program: Orca
programVersion: 5.0.2
elementType: O O O O N C C C C C C C C C C C C C C C C C C C H H H H H H H H H H H H H H H H H H H H H H H H H
charge: 0
multiplicity: 1
keywords: wb97x-d3
keywords: def2-TZVPP
keywords: def2/J RIJCOSX
keywords: DEFGRID2
keywords: scfconv7
keywords: smallprint printgap noloewdin
keywords: NOSOSCF
formula: C19H25NO4
InChI: InChI=1/C19H25NO4/c1-11(2)9-14-15(19(14,3)4)18(23)24-10-20-16(21)12-7-5-6-8-13(12)17(20)22/h9,14-15H,5-8,10H2,1-4H3
49 atoms
O  -0.250746 0.396037 1.486609
O  -1.232762 -1.618616 1.620301
O  1.642375 -1.640371 -0.09712
O  2.946186 2.052062 2.203895
N  2.050838 0.103536 1.350742
C  -2.515513 -0.531865 -1.059138
C  -3.531935 -0.580342 0.043108
C  -2.214596 0.110859 0.291104
C  -1.831069 -1.809903 -1.474756
C  -2.734249 0.426193 -2.203834
C  -4.774981 0.228178 -0.008564
C  -1.217357 -0.490019 1.191545
C  -5.984125 -0.246048 -0.321871
C  0.905742 -0.040748 2.189979
C  -7.186007 0.64781 -0.346716
C  -6.251766 -1.67655 -0.675932
C  3.467972 -0.085714 -0.457753
C  3.855331 0.991677 0.227641
C  4.113106 -0.587684 -1.695112
C  5.018837 1.846754 -0.111568
C  5.068133 0.476027 -2.240944
C  5.89872 1.121471 -1.131236
C  2.292758 -0.677131 0.226809
C  2.940999 1.171722 1.380621
H  -3.625356 -1.553288 0.51723
H  -2.22231 1.195776 0.287159
H  -0.821427 -1.616429 -1.841944
H  -1.767115 -2.543771 -0.67446
H  -2.391812 -2.270527 -2.290387
H  -3.405571 -0.016068 -2.94346
H  -3.171654 1.371415 -1.884075
H  -1.790681 0.648845 -2.70567
H  -4.679204 1.286852 0.216177
H  0.809802 -1.072703 2.518174
H  1.031356 0.594731 3.063216
H  -7.948125 0.300345 0.355543
H  -6.937584 1.677992 -0.092611
H  -7.654292 0.645674 -1.334324
H  -6.970153 -2.119914 0.018491
H  -6.703685 -1.744647 -1.668734
H  -5.358157 -2.298274 -0.67692
H  4.651184 -1.514454 -1.471364
H  3.35576 -0.851282 -2.437464
H  4.663197 2.800919 -0.514341
H  5.584935 2.092383 0.790387
H  5.723433 0.027598 -2.988402
H  4.489528 1.249766 -2.753864
H  6.615691 1.822968 -1.559266
H  6.48071 0.349552 -0.619171
elementType: O N C H
totalener: -1094.86904141 hartree
nucrepener: 2075.05840552 hartree
electener: -3169.92744693 hartree
oneelecener: -5612.56608385 hartree
twoeener: 2442.63863692 hartree
cpcmener: -0.03848288 hartree
kineticenergy: 1090.02280942 hartree
xcener: -105.970184044595 hartree
chargesum: 0.0000000
charge: -0.285316 -0.477800 -0.439130 -0.434190 -0.097286 0.159844 -0.009858 -0.129624 -0.303285 -0.268870 -0.269960 0.414760 -0.034238 0.081196 -0.228715 -0.251542 -0.057456 -0.075901 -0.072194 -0.075888 -0.137088 -0.134310 0.335037 0.345691 0.098275 0.096155 0.095119 0.096787 0.100496 0.097188 0.092525 0.099776 0.124402 0.141581 0.126412 0.095023 0.089439 0.094346 0.099027 0.096695 0.088257 0.101969 0.095081 0.102792 0.093786 0.081396 0.079404 0.081415 0.078777
qa: -0.2853 -0.4778 -0.4391 -0.4342 -0.0973 0.1598 -0.0099 -0.1296 -0.3033 -0.2689 -0.2700 0.4148 -0.0342 0.0812 -0.2287 -0.2515 -0.0575 -0.0759 -0.0722 -0.0759 -0.1371 -0.1343 0.3350 0.3457 0.0983 0.0962 0.0951 0.0968 0.1005 0.0972 0.0925 0.0998 0.1244 0.1416 0.1264 0.0950 0.0894 0.0943 0.0990 0.0967 0.0883 0.1020 0.0951 0.1028 0.0938 0.0814 0.0794 0.0814 0.0788
va: 2.1109 2.0269 2.0683 2.0776 3.1054 3.6546 3.7919 3.8884 3.8916 3.9047 3.8689 4.1621 3.7021 3.8625 3.9259 3.9417 3.6813 3.7096 3.9183 3.9175 3.9164 3.9142 4.1841 4.1949 1.0243 1.0364 1.0079 1.0155 1.0031 1.0024 1.0018 1.0027 1.0064 1.0155 1.0154 0.9952 1.0076 0.9963 0.9979 0.9974 1.0081 1.0047 1.0146 1.0048 1.0154 1.0092 1.0063 1.0094 1.0066
dispcorr: -0.023298284 hartree
energy: -1094.892339691315
dipole: -20.61982 21.64315 1.02333 -0.77648 1.72193 0.94545 -19.84379 18.09723 -1.74656
magnitude: 2.23418 au
magnitude: 5.67884 debye
