program: Orca
programVersion: 5.0.2
elementType: O O O O N C C C C C C C C C C C C C C C C C C C H H H H H H H H H H H H H H H H H H H H H H H H H
charge: 0
multiplicity: 1
keywords: wb97x-d3
keywords: def2-TZVPP
keywords: def2/J RIJCOSX
keywords: DEFGRID2
keywords: scfconv7
keywords: smallprint printgap noloewdin
keywords: NOSOSCF
formula: C19H25NO4
InChI: InChI=1/C19H25NO4/c1-11(2)9-14-15(19(14,3)4)18(23)24-10-20-16(21)12-7-5-6-8-13(12)17(20)22/h9,14-15H,5-8,10H2,1-4H3
49 atoms
O  -0.49144 1.498542 0.846867
O  -1.348612 2.270679 -1.07999
O  1.2609 0.383942 -1.609661
O  2.724697 1.259621 2.599645
N  1.78688 1.16645 0.492619
C  -4.029539 1.176027 0.176047
C  -3.516263 0.248414 -0.866946
C  -2.581005 0.703789 0.239847
C  -4.355666 2.59931 -0.201002
C  -4.919824 0.63341 1.267523
C  -3.928388 -1.176875 -0.949355
C  -1.44743 1.574481 -0.097481
C  -3.128586 -2.178733 -1.32446
C  0.754868 2.143916 0.629456
C  -3.626309 -3.589237 -1.398551
C  -1.687309 -1.989307 -1.684731
C  3.028519 -0.61165 -0.285551
C  3.465176 -0.344207 0.94602
C  3.558376 -1.680456 -1.166003
C  4.580048 -1.044318 1.62729
C  4.440858 -2.624008 -0.347161
C  5.364825 -1.862623 0.601029
C  1.931069 0.331445 -0.607569
C  2.6593 0.76978 1.500303
H  -3.31084 0.723149 -1.823641
H  -2.375181 -0.019688 1.020021
H  -5.409972 2.669313 -0.474789
H  -4.189722 3.275327 0.639502
H  -3.7779 2.962796 -1.047576
H  -5.961662 0.62138 0.941226
H  -4.6513 -0.380978 1.562525
H  -4.860755 1.263356 2.156605
H  -4.963128 -1.40228 -0.706868
H  0.971068 2.75561 1.501863
H  0.728345 2.784569 -0.248488
H  -4.671311 -3.673375 -1.101239
H  -3.529002 -3.986635 -2.411893
H  -3.036996 -4.245433 -0.752987
H  -1.466138 -2.461852 -2.644542
H  -1.39449 -0.943731 -1.753699
H  -1.038923 -2.472032 -0.948489
H  2.737127 -2.224366 -1.637802
H  4.128842 -1.226432 -1.981983
H  5.22822 -0.323327 2.130107
H  4.177624 -1.689662 2.413948
H  3.804952 -3.298225 0.232702
H  5.027526 -3.249119 -1.020844
H  6.004436 -1.191566 0.021433
H  6.027198 -2.557627 1.117788
elementType: O N C H
totalener: -1094.86833755 hartree
nucrepener: 2114.39597820 hartree
electener: -3209.26431575 hartree
oneelecener: -5691.27092324 hartree
twoeener: 2482.00660749 hartree
cpcmener: -0.03816863 hartree
kineticenergy: 1090.05150316 hartree
xcener: -105.976139716781 hartree
chargesum: 0.0000000
charge: -0.287314 -0.485992 -0.441481 -0.434837 -0.096687 0.153857 -0.011603 -0.114116 -0.279243 -0.284986 -0.306231 0.410071 -0.008818 0.080319 -0.229304 -0.238428 -0.054763 -0.081521 -0.070295 -0.073205 -0.133737 -0.135875 0.335253 0.346493 0.102937 0.096461 0.096051 0.100650 0.091842 0.099394 0.093671 0.098876 0.125061 0.126672 0.141110 0.090288 0.096856 0.094925 0.102190 0.070924 0.103080 0.094337 0.102152 0.094454 0.102355 0.078457 0.080398 0.078173 0.081129
qa: -0.2873 -0.4860 -0.4415 -0.4348 -0.0967 0.1539 -0.0116 -0.1141 -0.2792 -0.2850 -0.3062 0.4101 -0.0088 0.0803 -0.2293 -0.2384 -0.0548 -0.0815 -0.0703 -0.0732 -0.1337 -0.1359 0.3353 0.3465 0.1029 0.0965 0.0961 0.1007 0.0918 0.0994 0.0937 0.0989 0.1251 0.1267 0.1411 0.0903 0.0969 0.0949 0.1022 0.0709 0.1031 0.0943 0.1022 0.0945 0.1024 0.0785 0.0804 0.0782 0.0811
va: 2.1051 2.0136 2.0630 2.0775 3.1111 3.6948 3.8079 3.7991 3.8943 3.9098 3.8954 4.1335 3.7096 3.8631 3.9302 3.9434 3.6872 3.7154 3.9195 3.9170 3.9144 3.9169 4.1758 4.1936 1.0272 1.0319 1.0008 0.9991 1.0168 0.9998 1.0014 1.0027 1.0032 1.0156 1.0155 1.0058 0.9961 0.9961 1.0011 1.0144 0.9971 1.0141 1.0049 1.0152 1.0049 1.0067 1.0095 1.0070 1.0095
dispcorr: -0.023962180 hartree
energy: -1094.892299731742
dipole: -14.93548 15.94146 1.00598 -17.17107 15.28535 -1.88572 -3.85511 4.44071 0.58560
magnitude: 2.21605 au
magnitude: 5.63275 debye
