program: Orca
programVersion: 5.0.2
elementType: O O O O N C C C C C C C C C C C C C C C C C C C H H H H H H H H H H H H H H H H H H H H H H H H H
charge: 0
multiplicity: 1
keywords: wb97x-d3
keywords: def2-TZVPP
keywords: def2/J RIJCOSX
keywords: DEFGRID2
keywords: scfconv7
keywords: smallprint printgap noloewdin
keywords: NOSOSCF
formula: C19H25NO4
InChI: InChI=1/C19H25NO4/c1-11(2)9-14-15(19(14,3)4)18(23)24-10-20-16(21)12-7-5-6-8-13(12)17(20)22/h9,14-15H,5-8,10H2,1-4H3
49 atoms
O  -0.599983 1.434888 1.492149
O  -0.234109 -0.769187 1.328113
O  2.728573 -0.454904 2.119571
O  1.137742 2.860456 -0.554627
N  1.72435 1.352349 1.087969
C  -2.270209 -0.011788 -1.084045
C  -2.768291 -1.089614 -0.174866
C  -2.235053 0.189253 0.42484
C  -0.983751 -0.24252 -1.841725
C  -3.253111 0.855733 -1.830526
C  -4.205997 -1.440503 -0.051307
C  -0.939935 0.190639 1.125125
C  -4.723112 -2.172358 0.939533
C  0.695559 1.655669 2.0341
C  -6.177482 -2.531635 0.969968
C  -3.913535 -2.694088 2.086899
C  3.206772 0.121234 -0.179326
C  2.754588 1.103554 -0.960419
C  4.18417 -0.915024 -0.592052
C  3.163786 1.334997 -2.366792
C  4.310465 -0.912301 -2.116947
C  4.411085 0.505827 -2.678467
C  2.56094 0.23992 1.149976
C  1.780675 1.908236 -0.185791
H  -2.086738 -1.930406 -0.075501
H  -2.955394 0.906348 0.804858
H  -0.470748 0.701463 -2.039553
H  -0.291101 -0.902098 -1.319775
H  -1.202358 -0.704064 -2.80666
H  -2.796786 1.814783 -2.082545
H  -3.556056 0.379662 -2.765222
H  -4.153954 1.064011 -1.253277
H  -4.870177 -1.09678 -0.839072
H  0.863452 1.069376 2.936828
H  0.712827 2.710282 2.294292
H  -6.653742 -2.164565 1.882821
H  -6.719786 -2.123275 0.117234
H  -6.312002 -3.616372 0.967394
H  -4.339691 -2.361658 3.03698
H  -3.932255 -3.786942 2.109492
H  -2.8720 -2.376909 2.061035
H  5.151808 -0.708724 -0.122509
H  3.873811 -1.897126 -0.22653
H  2.336039 1.057753 -3.028491
H  3.346666 2.398223 -2.541539
H  5.184729 -1.493329 -2.411099
H  3.439904 -1.412286 -2.550122
H  4.565171 0.470614 -3.75716
H  5.287503 1.000543 -2.251399
elementType: O N C H
totalener: -1094.86728996 hartree
nucrepener: 2159.56466235 hartree
electener: -3254.43195231 hartree
oneelecener: -5781.70419570 hartree
twoeener: 2527.27224339 hartree
cpcmener: -0.03857261 hartree
kineticenergy: 1090.02458374 hartree
xcener: -105.970668627987 hartree
chargesum: -0.0000000
charge: -0.281146 -0.478734 -0.426522 -0.432972 -0.105389 0.172748 -0.048426 -0.098271 -0.276573 -0.299486 -0.279762 0.407810 -0.021330 0.084371 -0.231320 -0.245837 -0.017504 -0.109075 -0.074034 -0.063367 -0.133919 -0.138572 0.309478 0.326993 0.102362 0.100685 0.090612 0.091860 0.107210 0.099995 0.102754 0.091535 0.126991 0.135423 0.144911 0.094994 0.089864 0.095080 0.096544 0.099514 0.076632 0.102160 0.093351 0.102182 0.095631 0.081192 0.078896 0.081625 0.078837
qa: -0.2811 -0.4787 -0.4265 -0.4330 -0.1054 0.1727 -0.0484 -0.0983 -0.2766 -0.2995 -0.2798 0.4078 -0.0213 0.0844 -0.2313 -0.2458 -0.0175 -0.1091 -0.0740 -0.0634 -0.1339 -0.1386 0.3095 0.3270 0.1024 0.1007 0.0906 0.0919 0.1072 0.1000 0.1028 0.0915 0.1270 0.1354 0.1449 0.0950 0.0899 0.0951 0.0965 0.0995 0.0766 0.1022 0.0934 0.1022 0.0956 0.0812 0.0789 0.0816 0.0788
va: 2.1151 2.0130 2.0813 2.0676 3.0787 3.7277 3.8520 3.8149 3.8791 3.9068 3.8807 4.1545 3.7118 3.8958 3.9285 3.9387 3.6068 3.7175 3.9106 3.9117 3.9139 3.9215 4.1940 4.1556 1.0211 1.0294 1.0091 1.0118 1.0018 1.0026 0.9980 1.0008 1.0022 1.0136 0.9929 0.9963 1.0066 0.9954 0.9983 0.9987 1.0219 1.0037 1.0156 1.0064 1.0156 1.0094 1.0077 1.0093 1.0061
dispcorr: -0.025772228 hartree
energy: -1094.893062184510
dipole: -17.34024 17.56087 0.22063 -12.71777 12.83929 0.12152 -13.45607 12.01461 -1.44146
magnitude: 1.46330 au
magnitude: 3.71942 debye
