program: Orca
programVersion: 5.0.2
elementType: O O O O N C C C C C C C C C C C C C C C C C C C H H H H H H H H H H H H H H H H H H H H H H H H H
charge: 0
multiplicity: 1
keywords: wb97x-d3
keywords: def2-TZVPP
keywords: def2/J RIJCOSX
keywords: DEFGRID2
keywords: scfconv7
keywords: smallprint printgap noloewdin
keywords: NOSOSCF
formula: C19H25NO4
InChI: InChI=1/C19H25NO4/c1-11(2)9-14-15(19(14,3)4)18(23)24-10-20-16(21)12-7-5-6-8-13(12)17(20)22/h9,14-15H,5-8,10H2,1-4H3
49 atoms
O  -0.49532 1.480575 0.226491
O  -1.64039 3.170902 1.126915
O  2.156556 0.9609 2.284377
O  1.770974 1.061484 -2.238043
N  1.788207 1.381142 0.046434
C  -3.533778 0.87581 -0.609879
C  -2.788392 -0.23591 0.079189
C  -2.782352 1.145041 0.680314
C  -2.987982 1.398202 -1.915302
C  -5.039114 0.914102 -0.532026
C  -3.491746 -1.327699 0.79014
C  -1.604317 2.036241 0.706059
C  -3.487168 -2.617838 0.441132
C  0.691204 2.273906 0.172291
C  -4.227895 -3.63923 1.250014
C  -2.776355 -3.165423 -0.758247
C  3.289362 -0.292622 0.551868
C  3.179648 -0.260716 -0.777467
C  4.164856 -1.212565 1.315871
C  3.932763 -1.128409 -1.714862
C  4.643921 -2.336855 0.396535
C  5.081815 -1.808526 -0.968556
C  2.376477 0.723189 1.123569
C  2.182728 0.7739 -1.142326
H  -1.873169 -0.526363 -0.425207
H  -3.421996 1.302539 1.54317
H  -3.235349 2.453425 -2.048049
H  -1.907044 1.29246 -2.000942
H  -3.432584 0.850616 -2.748486
H  -5.407498 1.925006 -0.715691
H  -5.476191 0.261093 -1.290231
H  -5.417596 0.595547 0.438484
H  -4.060214 -1.040777 1.67053
H  0.814418 2.865779 1.077145
H  0.655915 2.941181 -0.687786
H  -4.735543 -3.197183 2.107057
H  -4.976209 -4.153753 0.641721
H  -3.549404 -4.411755 1.621369
H  -3.490732 -3.634238 -1.439961
H  -2.228384 -2.41438 -1.32417
H  -2.071524 -3.948462 -0.467815
H  5.013862 -0.650668 1.717572
H  3.63088 -1.612895 2.180625
H  3.252152 -1.872434 -2.140628
H  4.306292 -0.543483 -2.558284
H  5.466499 -2.871377 0.872724
H  3.834936 -3.060361 0.263217
H  5.478366 -2.622875 -1.575711
H  5.896437 -1.091592 -0.833935
elementType: O N C H
totalener: -1094.86814995 hartree
nucrepener: 2096.76465704 hartree
electener: -3191.63280699 hartree
oneelecener: -5655.21548909 hartree
twoeener: 2463.58268210 hartree
cpcmener: -0.03846974 hartree
kineticenergy: 1090.04793259 hartree
xcener: -105.973135960398 hartree
chargesum: 0.0000000
charge: -0.269072 -0.490439 -0.432710 -0.437005 -0.121816 0.122518 0.054401 -0.157765 -0.273267 -0.269490 -0.301536 0.441249 -0.035056 0.078015 -0.226125 -0.253173 -0.063817 -0.056444 -0.071029 -0.073698 -0.135115 -0.135107 0.334601 0.333911 0.099620 0.100634 0.101445 0.084006 0.096395 0.098753 0.095922 0.090193 0.124044 0.129016 0.144242 0.089267 0.093946 0.094517 0.097391 0.088440 0.096317 0.101921 0.093569 0.103531 0.095150 0.080278 0.078963 0.081729 0.078682
qa: -0.2691 -0.4904 -0.4327 -0.4370 -0.1218 0.1225 0.0544 -0.1578 -0.2733 -0.2695 -0.3015 0.4412 -0.0351 0.0780 -0.2261 -0.2532 -0.0638 -0.0564 -0.0710 -0.0737 -0.1351 -0.1351 0.3346 0.3339 0.0996 0.1006 0.1014 0.0840 0.0964 0.0988 0.0959 0.0902 0.1240 0.1290 0.1442 0.0893 0.0939 0.0945 0.0974 0.0884 0.0963 0.1019 0.0936 0.1035 0.0951 0.0803 0.0790 0.0817 0.0787
va: 2.1041 2.0052 2.0762 2.0673 3.1544 3.7107 3.7237 3.9253 3.9012 3.9003 3.8595 4.1210 3.7240 3.8747 3.9238 3.9446 3.6878 3.7056 3.9164 3.9184 3.9179 3.9142 4.1893 4.1741 1.0186 1.0319 1.0013 1.0174 1.0016 1.0025 1.0027 1.0032 1.0069 1.0133 1.0007 1.0082 0.9962 0.9956 0.9972 1.0095 0.9972 1.0042 1.0156 1.0049 1.0145 1.0095 1.0068 1.0094 1.0066
dispcorr: -0.022899002 hartree
energy: -1094.891048953171
dipole: -15.74361 16.93113 1.18752 -22.19842 19.78724 -2.41118 -6.14405 5.22634 -0.91771
magnitude: 2.84010 au
magnitude: 7.21897 debye
