program: Gaussian 09
title: 000067962
version: EM64L-G09RevD.01
frameworkgroup: C1[X(C7H5ClF3N)]
method: RPBEPBE
basis: SDD
operation: Freq
keyword: #p
keyword: freq=noraman
keyword: PBEPBE/SDD
title: #p freq=noraman PBEPBE/SDD
converged: NO YES NO YES
title: Mulliken charges:
elementType: Cl F F F N C C C C C C C H H H H H
charge: -0.013866 -0.172306 -0.161850 -0.161938 -0.688116 0.366114 -0.212944 -0.332433 0.543425 -0.405135 -0.420341 0.268589 0.266433 0.254475 0.232092 0.318608 0.319193
chargesum: 0.00000
title: Mulliken charges with hydrogens summed into heavy atoms:
elementType: Cl F F F N C C C C C C C
charge: -0.013866 -0.172306 -0.161850 -0.161938 -0.050314 0.366114 -0.212944 -0.066001 0.543425 -0.150661 -0.188249 0.268589
polarizability: 1.33889927e+02 8.47243990e+00 1.04564449e+02 -8.07447140e-04 2.57358578e-04 4.39558057e+01
1716.lowfreq: -8.9750 -5.7069 -0.0030 -0.0023 -0.0019 8.9145 47.2167 80.9564 149.6385
frequency: 47.1854 80.9523 149.6378 169.7750 213.9901 225.2523 283.3313 330.6343 371.7588 403.3149 409.0913 428.0995 431.6508 444.7524 506.7236 537.3347 564.8356 605.2718 674.6241 684.0715 714.8032 817.9678 854.1817 880.4779 954.0672 974.0730 984.8858 998.5667 1041.4234 1059.0675 1166.5619 1250.6585 1286.9174 1335.3541 1382.9472 1440.4301 1514.4562 1562.9566 1634.2732 1649.9636 3143.0965 3156.2229 3177.5319 3562.3076 3700.8365
redmass: 16.0776 5.7563 18.5252 5.7673 6.1890 7.0107 14.4384 6.6336 8.0670 1.0749 9.0940 5.1914 1.9021 1.6134 10.9616 7.5805 8.8569 3.5338 8.8041 8.4024 3.3360 1.4328 1.7159 5.9621 1.4700 6.8994 6.8534 6.1110 1.6153 2.6390 1.2893 1.4623 3.0827 2.7429 4.5840 4.6332 3.9329 7.0382 3.6853 1.3726 1.0897 1.0924 1.0950 1.0454 1.1041
irintensity: 0.0223 0.3866 0.0890 1.3999 2.8166 0.2319 4.3134 1.5181 6.0825 0.5304 7.4443 4.1371 138.0488 171.9299 5.8720 7.8297 25.9411 4.1534 4.9673 2.0901 2.4317 53.9430 49.2855 24.5498 29.7947 77.8117 214.8219 115.5514 65.8014 154.2500 13.4093 4.9923 360.1537 83.1265 32.7734 18.3771 18.8225 54.2934 170.8155 343.8705 9.5524 3.4798 3.2211 102.0627 27.6915
temp: 298.150 k
press: 1.00000 atm
elementType: 17 9 9 9 7 6 6 6 6 6 6 6 1 1 1 1 1
symmnumber: 1
zpe: 285945.3 jmol-1
zpe.correction: 0.108911 hartree
zpe.thermalcorrener: 0.119875 hartree
zpe.thermalcorrenthalpy: 0.120819 hartree
zpe.thermalcorrgfe: 0.071640 hartree
zpe.sumelectzpe: -1083.220075 hartree
zpe.sumelectthermal: -1083.209111 hartree
zpe.sumelectthermalent: -1083.208167 hartree
zpe.sumelectthermalfe: -1083.257346 hartree
dipole: -7.6418 -0.9255 -0.0006
dipole: 7.6977
quadrupole: -58.3920 -69.9121 -79.7530
quadrupole: 1.6665 -0.0026 -0.0001
quadrupole: 10.9604 -0.5598 -10.4006 1.6665 -0.0026 -0.0001
hfenergy: -1083.328986 hartree
pointgroup: C01 [X(C7H5Cl1F3N1)]
dipole: -2.9907069 0.4769507 0.0024476 debye
dipolederiv: -0.233007 0.2332516 0.0000708 0.2890241 -0.5859348 0.0000272 0.0000478 0.0000529 -0.0357193 -0.5320692 -0.2373378 0.0001958 -0.1984282 -0.7260969 0.0000505 0.0002912 0.0001393 -0.2913516 -0.7452853 0.050316 -0.2170748 0.1770805 -0.324446 0.1741608 -0.2765074 0.1390966 -0.6388492 -0.7446856 0.0499567 0.2172638 0.1766787 -0.3243882 -0.1744183 0.277143 -0.1391301 -0.6399346 -1.6502646 0.0029926 0.0007265 -0.0416062 -0.1286936 -0.00029 0.0007467 -0.0003135 -0.7269597 -0.9283425 0.0389867 0.0005339 0.0016358 -0.517215 0.0001489 0.0002704 0.0000759 -0.2070004 0.779818 -0.2714635 -0.000516 -0.2014996 1.0068085 -0.0002903 -0.0005287 -0.0002128 -0.0084739 0.4603262 -0.1726006 -0.0003222 -0.1860351 0.1144242 0.0000535 -0.0002031 0.0000648 -0.0698417 1.7829264 0.0128263 -0.0012601 0.0025097 0.1772082 0.0000168 -0.0012563 -0.0000148 0.1783026 -0.6661797 0.0887229 0.0003484 0.4941533 -0.2037949 -0.0003998 0.0001441 -0.0000851 -0.1860412 -0.5156712 -0.0076644 0.0002359 -0.441333 -0.0126572 0.0002196 0.0004642 -0.0001006 -0.2372556 2.4007903 0.2152951 -0.0007392 -0.0610936 1.3054748 0.0001545 -0.0011288 -0.0001247 1.5743866 0.0986638 -0.0393736 0.0000603 -0.0395157 -0.0002908 0.0001098 0.0000503 0.0001097 0.1544458 0.0274974 -0.0629207 0.0001514 -0.060616 -0.0040419 0.0001424 0.0001494 0.000146 0.1770146 -0.0083611 0.0984596 0.0000905 0.0823103 -0.0362463 0.000044 0.0000865 0.0000212 0.1767959 0.2376988 -0.0132278 0.0001252 -0.0572234 0.1308426 0.0001827 0.0001441 0.0001523 0.3904209 0.2361453 0.0137808 0.0001096 0.0639583 0.1290473 0.0000877 0.0000865 0.0001231 0.3900608 unknown
polarizability: 133.2113715|-9.5509004|105.2429385|-0.0679667|-0.0218498|43.9558715 unknown
InChI: InChI=1S/C7H5ClF3N/c8-6-3-4(12)1-2-5(6)7(9,10)11/h1-3H,12H2
charge 0 multiplicity 1
17 atoms
Cl 0.616201 -2.59028 0.000467
F  2.377987 1.661597 -0.002213
F  2.53252 -0.294087 1.129344
F  2.530449 -0.293667 -1.134827
N  -3.824698 0.088055 0.002738
C  0.428816 0.230195 -0.000552
C  -0.272755 -1.003187 0.00053
C  -0.34725 1.418676 -0.000598
C  -2.438649 0.138663 0.001638
C  -1.671549 -1.064231 0.001676
C  -1.747884 1.387204 0.000467
C  1.923221 0.316597 -0.001971
H  0.171888 2.380996 -0.001476
H  -2.168959 -2.039071 0.002568
H  -2.313745 2.325035 0.000412
H  -4.3767 0.941219 0.002707
H  -4.317894 -0.800413 0.003591
