program: Orca
programVersion: 5.0.2
elementType: O O O O N C C C C C C C C C C C C C C C C C C C H H H H H H H H H H H H H H H H H H H H H H H H H
charge: 0
multiplicity: 1
keywords: wb97x-d3
keywords: def2-TZVPP
keywords: def2/J RIJCOSX
keywords: DEFGRID2
keywords: scfconv7
keywords: smallprint printgap noloewdin
keywords: NOSOSCF
formula: C19H25NO4
InChI: InChI=1/C19H25NO4/c1-11(2)9-14-15(19(14,3)4)18(23)24-10-20-16(21)12-7-5-6-8-13(12)17(20)22/h9,14-15H,5-8,10H2,1-4H3
49 atoms
O  -0.588662 1.884861 1.184137
O  -0.265528 -0.285456 1.619069
O  2.728878 0.193411 2.325839
O  1.133683 2.582858 -1.196768
N  1.731718 1.629479 0.814867
C  -2.338333 -0.184004 -0.868383
C  -2.857598 -0.934747 0.328216
C  -2.267746 0.437585 0.516804
C  -1.078753 -0.677008 -1.538065
C  -3.315668 0.443079 -1.831216
C  -4.303131 -1.138736 0.558439
C  -0.958217 0.597512 1.172606
C  -4.918406 -2.312672 0.732024
C  0.716771 2.210868 1.63861
C  -6.398738 -2.376204 0.96015
C  -4.234232 -3.645238 0.710296
C  3.287568 0.151922 -0.027457
C  2.826199 0.857481 -1.060852
C  4.323465 -0.905737 -0.112744
C  3.28069 0.714973 -2.465235
C  4.512452 -1.311248 -1.575584
C  4.577408 -0.095448 -2.499192
C  2.588309 0.601893 1.200979
C  1.801414 1.804123 -0.561782
H  -2.213417 -1.746656 0.649401
H  -2.955639 1.260805 0.680803
H  -0.396549 -1.180097 -0.854466
H  -1.334256 -1.390652 -2.323435
H  -0.538963 0.147679 -2.008562
H  -3.662779 -0.295568 -2.556413
H  -4.191835 0.857226 -1.334246
H  -2.83863 1.252308 -2.386893
H  -4.913922 -0.240663 0.584413
H  0.877755 1.895644 2.669004
H  0.76402 3.295626 1.59481
H  -6.627897 -2.843959 1.921194
H  -6.860318 -1.38907 0.947454
H  -6.886237 -2.987808 0.196594
H  -4.62887 -4.261045 -0.101901
H  -3.155633 -3.584066 0.580952
H  -4.430306 -4.195026 1.634067
H  5.26033 -0.526939 0.30802
H  4.042776 -1.765625 0.499484
H  2.497475 0.218713 -3.047231
H  3.420008 1.697343 -2.921842
H  5.420244 -1.906999 -1.675225
H  3.680364 -1.952084 -1.879918
H  4.784222 -0.411287 -3.522028
H  5.408706 0.545743 -2.193608
elementType: O N C H
totalener: -1094.86889712 hartree
nucrepener: 2141.18619366 hartree
electener: -3236.05509078 hartree
oneelecener: -5744.96105852 hartree
twoeener: 2508.90596774 hartree
cpcmener: -0.04017408 hartree
kineticenergy: 1090.04857361 hartree
xcener: -105.976163882611 hartree
chargesum: 0.0000000
charge: -0.276678 -0.473125 -0.428381 -0.434277 -0.101011 0.130309 0.022857 -0.117469 -0.278243 -0.270483 -0.286630 0.403615 -0.048373 0.083070 -0.220587 -0.251419 -0.030117 -0.089576 -0.074105 -0.067165 -0.134561 -0.137939 0.316287 0.319335 0.093492 0.100461 0.090316 0.106069 0.090525 0.098013 0.089876 0.098620 0.123250 0.135351 0.146741 0.094467 0.088918 0.093263 0.097849 0.090103 0.095136 0.101086 0.093271 0.102655 0.094943 0.081089 0.078854 0.081205 0.079114
qa: -0.2767 -0.4731 -0.4284 -0.4343 -0.1010 0.1303 0.0229 -0.1175 -0.2782 -0.2705 -0.2866 0.4036 -0.0484 0.0831 -0.2206 -0.2514 -0.0301 -0.0896 -0.0741 -0.0672 -0.1346 -0.1379 0.3163 0.3193 0.0935 0.1005 0.0903 0.1061 0.0905 0.0980 0.0899 0.0986 0.1232 0.1354 0.1467 0.0945 0.0889 0.0933 0.0978 0.0901 0.0951 0.1011 0.0933 0.1027 0.0949 0.0811 0.0789 0.0812 0.0791
va: 2.1137 2.0330 2.0803 2.0653 3.0802 3.6901 3.7946 3.8298 3.8987 3.8999 3.8610 4.2024 3.7514 3.8872 3.9212 3.9415 3.6349 3.7151 3.9120 3.9140 3.9148 3.9201 4.1893 4.1618 1.0317 1.0328 1.0141 1.0013 1.0092 1.0020 1.0046 1.0026 1.0082 1.0142 0.9920 0.9959 1.0084 0.9963 0.9969 1.0096 0.9971 1.0040 1.0158 1.0058 1.0158 1.0091 1.0073 1.0093 1.0061
dispcorr: -0.024960791 hartree
energy: -1094.893857909823
dipole: -17.91028 18.25582 0.34554 -18.50822 18.22194 -0.28628 -13.78738 12.18915 -1.59823
magnitude: 1.66003 au
magnitude: 4.21946 debye
