program: Orca
programVersion: 5.0.2
elementType: O O O O N C C C C C C C C C C C C C C C C C C C H H H H H H H H H H H H H H H H H H H H H H H H H
charge: 0
multiplicity: 1
keywords: wb97x-d3
keywords: def2-TZVPP
keywords: def2/J RIJCOSX
keywords: DEFGRID2
keywords: scfconv7
keywords: smallprint printgap noloewdin
keywords: NOSOSCF
formula: C19H25NO4
InChI: InChI=1/C19H25NO4/c1-11(2)9-14-15(19(14,3)4)18(23)24-10-20-16(21)12-7-5-6-8-13(12)17(20)22/h9,14-15H,5-8,10H2,1-4H3
49 atoms
O  -0.669257 1.773511 1.38431
O  -0.555034 1.982494 -0.839874
O  2.489821 2.342967 -0.793684
O  1.076964 -0.518944 2.445503
N  1.590237 1.208718 1.009336
C  -3.601778 1.244874 -0.814322
C  -2.814878 -0.011797 -0.917966
C  -2.484826 0.994563 0.18441
C  -3.45814 2.291513 -1.89163
C  -4.990652 1.193557 -0.223591
C  -3.345841 -1.349097 -0.555032
C  -1.169997 1.642446 0.144293
C  -2.59203 -2.370595 -0.137862
C  0.68189 2.186502 1.524755
C  -3.194603 -3.7028 0.186395
C  -1.108682 -2.278108 0.054752
C  2.947184 0.001739 -0.408996
C  2.529423 -0.843052 0.534564
C  3.868524 -0.343613 -1.517892
C  2.888423 -2.27944 0.614058
C  4.523392 -1.695959 -1.232604
C  3.515542 -2.718749 -0.710608
C  2.345443 1.332761 -0.153317
C  1.649007 -0.101997 1.468547
H  -2.080291 -0.010316 -1.71955
H  -2.815987 0.719973 1.178782
H  -3.558322 3.297286 -1.479867
H  -2.511188 2.234343 -2.422294
H  -4.251538 2.159748 -2.629707
H  -5.720223 0.907406 -0.983467
H  -5.072068 0.485413 0.600983
H  -5.277681 2.175536 0.156198
H  -4.416498 -1.501066 -0.65791
H  0.826372 2.31039 2.594754
H  0.8734 3.13998 1.034179
H  -2.983677 -3.985403 1.220917
H  -4.275374 -3.710185 0.047359
H  -2.767097 -4.489322 -0.440523
H  -0.597329 -3.048293 -0.528484
H  -0.693101 -1.313054 -0.231211
H  -0.847178 -2.460886 1.100202
H  3.307072 -0.374448 -2.456893
H  4.622221 0.43726 -1.642525
H  3.584428 -2.434386 1.444374
H  2.004131 -2.878474 0.8450
H  5.000153 -2.068503 -2.139797
H  5.3177 -1.561745 -0.493134
H  3.998646 -3.687744 -0.5815
H  2.72426 -2.857817 -1.452577
elementType: O N C H
totalener: -1094.86844132 hartree
nucrepener: 2187.08864820 hartree
electener: -3281.95708952 hartree
oneelecener: -5836.69867464 hartree
twoeener: 2554.74158512 hartree
cpcmener: -0.03975850 hartree
kineticenergy: 1090.04536747 hartree
xcener: -105.975351232250 hartree
chargesum: -0.0000000
charge: -0.286402 -0.491263 -0.429409 -0.432635 -0.099207 0.175609 -0.022161 -0.101196 -0.282508 -0.290935 -0.303169 0.398391 0.005354 0.089566 -0.231344 -0.248535 -0.033316 -0.083074 -0.070892 -0.083577 -0.136069 -0.132809 0.326938 0.302815 0.107782 0.091776 0.101342 0.091647 0.094715 0.100401 0.092790 0.098521 0.125671 0.144594 0.132794 0.095718 0.091144 0.096889 0.102574 0.074687 0.096540 0.101936 0.094310 0.109573 0.094808 0.081387 0.078389 0.081505 0.078335
qa: -0.2864 -0.4913 -0.4294 -0.4326 -0.0992 0.1756 -0.0222 -0.1012 -0.2825 -0.2909 -0.3032 0.3984 0.0054 0.0896 -0.2313 -0.2485 -0.0333 -0.0831 -0.0709 -0.0836 -0.1361 -0.1328 0.3269 0.3028 0.1078 0.0918 0.1013 0.0916 0.0947 0.1004 0.0928 0.0985 0.1257 0.1446 0.1328 0.0957 0.0911 0.0969 0.1026 0.0747 0.0965 0.1019 0.0943 0.1096 0.0948 0.0814 0.0784 0.0815 0.0783
va: 2.1041 2.0096 2.0793 2.0663 3.0856 3.6896 3.8176 3.8086 3.8803 3.9147 3.8925 4.1351 3.7346 3.8907 3.9268 3.9458 3.6361 3.6771 3.9112 3.9165 3.9169 3.9140 4.1894 4.1759 1.0228 1.0339 0.9991 1.0194 1.0009 0.9989 1.0011 1.0025 1.0028 0.9937 1.0154 0.9961 1.0060 0.9960 0.9982 1.0067 1.0030 1.0053 1.0147 1.0042 1.0109 1.0093 1.0066 1.0095 1.0076
dispcorr: -0.026434234 hartree
energy: -1094.894875552121
dipole: -14.47477 14.73962 0.26485 -17.69076 15.92545 -1.76532 -8.52704 8.60263 0.07558
magnitude: 1.78667 au
magnitude: 4.54136 debye
