program: Orca
programVersion: 5.0.2
elementType: O O O O N C C C C C C C C C C C C C C C C C C C H H H H H H H H H H H H H H H H H H H H H H H H H
charge: 0
multiplicity: 1
keywords: wb97x-d3
keywords: def2-TZVPP
keywords: def2/J RIJCOSX
keywords: DEFGRID2
keywords: scfconv7
keywords: smallprint printgap noloewdin
keywords: NOSOSCF
formula: C19H25NO4
InChI: InChI=1/C19H25NO4/c1-11(2)9-14-15(19(14,3)4)18(23)24-10-20-16(21)12-7-5-6-8-13(12)17(20)22/h9,14-15H,5-8,10H2,1-4H3
49 atoms
O  -0.394419 0.482809 -0.522412
O  -1.87506 1.06045 -2.089302
O  2.486327 2.435972 -0.308845
O  1.863188 -2.030773 -0.867011
N  1.873638 0.275405 -0.833545
C  -3.730525 1.560136 0.435838
C  -4.061228 0.264338 -0.211869
C  -2.613459 0.566094 0.13791
C  -3.864504 2.831028 -0.36508
C  -4.031084 1.747836 1.90297
C  -4.762635 -0.845444 0.480382
C  -1.637078 0.74306 -0.944592
C  -4.526094 -2.133846 0.220426
C  0.645317 0.532947 -1.498066
C  -5.255164 -3.230586 0.930626
C  -3.489153 -2.569592 -0.774228
C  3.817154 0.531757 0.375725
C  3.636896 -0.7791 0.207247
C  4.960988 1.152677 1.085697
C  4.56145 -1.835328 0.684456
C  5.71415 0.082306 1.877781
C  5.899155 -1.203835 1.074486
C  2.68883 1.248476 -0.26505
C  2.37692 -0.988711 -0.545478
H  -4.265667 0.33958 -1.278131
H  -2.219972 0.05832 1.010908
H  -3.734159 2.679865 -1.434193
H  -4.862089 3.248663 -0.217081
H  -3.143754 3.581864 -0.037003
H  -5.067092 2.060874 2.046387
H  -3.874462 0.837891 2.482038
H  -3.390943 2.523352 2.32718
H  -5.512171 -0.581925 1.221163
H  0.694535 1.513494 -1.969509
H  0.482674 -0.221935 -2.2668
H  -5.818279 -3.846677 0.225159
H  -4.554565 -3.902683 1.432975
H  -5.950858 -2.847358 1.676917
H  -2.505266 -2.647052 -0.302618
H  -3.721846 -3.554356 -1.181269
H  -3.38919 -1.87829 -1.611283
H  5.620418 1.630866 0.354644
H  4.611988 1.95163 1.743852
H  4.111368 -2.351055 1.538424
H  4.69976 -2.59525 -0.087866
H  6.685106 0.473718 2.182914
H  5.162838 -0.140493 2.795268
H  6.485293 -1.921104 1.649858
H  6.471303 -0.986277 0.168452
elementType: O N C H
totalener: -1094.86913164 hartree
nucrepener: 2059.28329036 hartree
electener: -3154.15242200 hartree
oneelecener: -5580.68705342 hartree
twoeener: 2426.53463142 hartree
cpcmener: -0.03583593 hartree
kineticenergy: 1090.03927294 hartree
xcener: -105.971962960799 hartree
chargesum: -0.0000000
charge: -0.284330 -0.502041 -0.433898 -0.435728 -0.112102 0.151478 -0.008415 -0.087418 -0.277014 -0.283866 -0.318919 0.404981 0.012901 0.086131 -0.228967 -0.273321 -0.073932 -0.067513 -0.069662 -0.074495 -0.135855 -0.134100 0.340441 0.343058 0.099681 0.095421 0.090219 0.096504 0.100304 0.100311 0.092783 0.098664 0.125396 0.128486 0.136602 0.095757 0.098900 0.087949 0.105394 0.105035 0.093349 0.102639 0.093980 0.102768 0.093883 0.080849 0.078893 0.080713 0.078110
qa: -0.2843 -0.5020 -0.4339 -0.4357 -0.1121 0.1515 -0.0084 -0.0874 -0.2770 -0.2839 -0.3189 0.4050 0.0129 0.0861 -0.2290 -0.2733 -0.0739 -0.0675 -0.0697 -0.0745 -0.1359 -0.1341 0.3404 0.3431 0.0997 0.0954 0.0902 0.0965 0.1003 0.1003 0.0928 0.0987 0.1254 0.1285 0.1366 0.0958 0.0989 0.0879 0.1054 0.1050 0.0933 0.1026 0.0940 0.1028 0.0939 0.0808 0.0789 0.0807 0.0781
va: 2.1017 1.9938 2.0776 2.0733 3.1366 3.7253 3.8054 3.8324 3.8899 3.9105 3.8962 4.0917 3.6722 3.8876 3.9322 3.9520 3.6959 3.6916 3.9187 3.9213 3.9188 3.9168 4.1851 4.1813 1.0241 1.0296 1.0174 1.0007 0.9995 0.9994 1.0016 1.0028 1.0035 1.0058 1.0002 0.9949 0.9940 1.0064 0.9962 1.0028 1.0054 1.0043 1.0151 1.0045 1.0149 1.0094 1.0063 1.0095 1.0067
dispcorr: -0.022627092 hartree
energy: -1094.891758729646
dipole: -15.77469 17.26356 1.48888 -6.17084 5.42094 -0.74990 11.77646 -10.08676 1.68970
magnitude: 2.37364 au
magnitude: 6.03333 debye
