program: Orca
programVersion: 5.0.2
elementType: O O O O N C C C C C C C C C C C C C C C C C C C H H H H H H H H H H H H H H H H H H H H H H H H H
charge: 0
multiplicity: 1
keywords: wb97x-d3
keywords: def2-TZVPP
keywords: def2/J RIJCOSX
keywords: DEFGRID2
keywords: scfconv7
keywords: smallprint printgap noloewdin
keywords: NOSOSCF
formula: C19H25NO4
InChI: InChI=1/C19H25NO4/c1-11(2)9-14-15(19(14,3)4)18(23)24-10-20-16(21)12-7-5-6-8-13(12)17(20)22/h9,14-15H,5-8,10H2,1-4H3
49 atoms
O  -0.365598 0.700368 -0.132583
O  -1.903509 2.203668 -0.727599
O  2.250939 -0.297128 -2.113307
O  2.118636 1.788339 1.919229
N  1.908297 0.99801 -0.236445
C  -3.669079 0.437508 1.235308
C  -4.035041 0.184411 -0.185569
C  -2.577818 0.107315 0.222993
C  -3.799233 1.833211 1.792759
C  -3.929778 -0.637513 2.262369
C  -4.751078 -1.045964 -0.6131
C  -1.628235 1.120058 -0.26107
C  -4.53365 -1.699227 -1.75727
C  0.661688 1.586998 -0.57532
C  -5.314522 -2.926154 -2.115748
C  -3.5056 -1.281458 -2.763167
C  3.739371 -0.399636 -0.205584
C  3.699738 0.210975 0.980019
C  4.77345 -1.373874 -0.630714
C  4.692979 0.029124 2.066378
C  5.578251 -1.828813 0.588605
C  5.937821 -0.659081 1.504126
C  2.579366 0.055541 -1.008802
C  2.512671 1.098226 1.013002
H  -4.280214 1.080988 -0.750613
H  -2.156811 -0.887061 0.319934
H  -4.780578 1.948988 2.256535
H  -3.049339 2.020018 2.563508
H  -3.707445 2.608671 1.035386
H  -4.95439 -0.571847 2.633517
H  -3.78301 -1.641556 1.864821
H  -3.261796 -0.518897 3.117053
H  -5.522122 -1.417842 0.0563
H  0.577062 2.556503 -0.086848
H  0.608574 1.728024 -1.654334
H  -4.649301 -3.777058 -2.282794
H  -6.027249 -3.201602 -1.338892
H  -5.867325 -2.779746 -3.0471
H  -3.95036 -1.209029 -3.7586
H  -3.042254 -0.323135 -2.535141
H  -2.711384 -2.029581 -2.835623
H  4.31054 -2.22524 -1.134782
H  5.426355 -0.902161 -1.371732
H  4.945842 0.991582 2.516438
H  4.24677 -0.571355 2.86528
H  4.994068 -2.561338 1.151979
H  6.48392 -2.337919 0.257802
H  6.528804 0.070604 0.943928
H  6.564957 -1.006354 2.325782
elementType: O N C H
totalener: -1094.86994683 hartree
nucrepener: 2058.39448406 hartree
electener: -3153.26443090 hartree
oneelecener: -5578.88223777 hartree
twoeener: 2425.61780688 hartree
cpcmener: -0.03582884 hartree
kineticenergy: 1090.03708842 hartree
xcener: -105.971617201466 hartree
chargesum: 0.0000000
charge: -0.279974 -0.501156 -0.433019 -0.433316 -0.120357 0.147585 -0.007093 -0.101121 -0.279037 -0.285442 -0.301273 0.411722 -0.013108 0.090936 -0.229441 -0.244122 -0.069520 -0.066432 -0.070740 -0.073841 -0.136736 -0.134718 0.339795 0.339540 0.101782 0.096687 0.097241 0.101749 0.090483 0.099882 0.094037 0.098700 0.124705 0.129980 0.135341 0.095021 0.090175 0.096546 0.101521 0.082375 0.101796 0.093653 0.102293 0.093976 0.102954 0.078660 0.081588 0.078427 0.081296
qa: -0.2800 -0.5012 -0.4330 -0.4333 -0.1204 0.1476 -0.0071 -0.1011 -0.2790 -0.2854 -0.3013 0.4117 -0.0131 0.0909 -0.2294 -0.2441 -0.0695 -0.0664 -0.0707 -0.0738 -0.1367 -0.1347 0.3398 0.3395 0.1018 0.0967 0.0972 0.1017 0.0905 0.0999 0.0940 0.0987 0.1247 0.1300 0.1353 0.0950 0.0902 0.0965 0.1015 0.0824 0.1018 0.0937 0.1023 0.0940 0.1030 0.0787 0.0816 0.0784 0.0813
va: 2.1070 1.9944 2.0779 2.0776 3.1417 3.7069 3.8087 3.8364 3.8931 3.9087 3.8950 4.0927 3.7039 3.8850 3.9305 3.9349 3.6898 3.6795 3.9171 3.9204 3.9176 3.9149 4.1884 4.1887 1.0266 1.0279 1.0010 0.9989 1.0168 0.9998 1.0018 1.0028 1.0028 1.0041 1.0018 0.9963 1.0061 0.9962 0.9997 1.0138 0.9979 1.0154 1.0041 1.0150 1.0047 1.0067 1.0092 1.0067 1.0095
dispcorr: -0.022498436 hartree
energy: -1094.892445270463
dipole: -15.98035 17.48543 1.50508 -14.45124 12.70565 -1.74559 2.79144 -2.07586 0.71557
magnitude: 2.41338 au
magnitude: 6.13432 debye
