program: Orca
programVersion: 5.0.2
elementType: O O O O N C C C C C C C C C C C C C C C C C C C H H H H H H H H H H H H H H H H H H H H H H H H H
charge: 0
multiplicity: 1
keywords: wb97x-d3
keywords: def2-TZVPP
keywords: def2/J RIJCOSX
keywords: DEFGRID2
keywords: scfconv7
keywords: smallprint printgap noloewdin
keywords: NOSOSCF
formula: C19H25NO4
InChI: InChI=1/C19H25NO4/c1-11(2)9-14-15(19(14,3)4)18(23)24-10-20-16(21)12-7-5-6-8-13(12)17(20)22/h9,14-15H,5-8,10H2,1-4H3
49 atoms
O  -0.461676 0.951508 -0.567169
O  -1.666706 1.70558 1.170931
O  2.7427 1.427113 -2.258464
O  1.444484 0.459172 1.984134
N  1.809662 1.223512 -0.157022
C  -2.733982 -1.258445 1.083517
C  -3.761724 -0.32709 0.538797
C  -2.35124 -0.261198 -0.006342
C  -2.241523 -1.067596 2.497584
C  -2.747216 -2.703074 0.648755
C  -4.872788 -0.799994 -0.32857
C  -1.496041 0.896678 0.2894
C  -5.331426 -0.166563 -1.411226
C  0.571653 1.904526 -0.353779
C  -6.472744 -0.715558 -2.211692
C  -4.765469 1.122784 -1.920014
C  3.817394 0.151063 -0.505919
C  3.432648 -0.146655 0.735906
C  5.085994 -0.287676 -1.135876
C  4.192694 -0.996669 1.683442
C  6.026972 -0.828485 -0.058047
C  5.299557 -1.737736 0.930049
C  2.774054 0.997831 -1.132683
C  2.128424 0.510708 0.991687
H  -4.013833 0.496398 1.203151
H  -2.192042 -0.700057 -0.984635
H  -2.382621 -0.05439 2.866731
H  -2.790722 -1.733341 3.165836
H  -1.182082 -1.317126 2.584895
H  -3.059641 -2.826002 -0.388065
H  -1.753235 -3.142273 0.749791
H  -3.428362 -3.283761 1.273912
H  -5.358179 -1.724861 -0.028359
H  0.358624 2.540325 0.502128
H  0.650742 2.527074 -1.241874
H  -6.174396 -0.885869 -3.249316
H  -6.84522 -1.656961 -1.808502
H  -7.30487 -0.007884 -2.243165
H  -4.370382 0.998577 -2.931706
H  -5.549286 1.881229 -1.988319
H  -3.970393 1.523875 -1.294949
H  4.872457 -1.054265 -1.887186
H  5.547141 0.542873 -1.675047
H  4.614314 -0.367421 2.47338
H  3.522528 -1.699346 2.18373
H  6.848386 -1.369009 -0.529105
H  6.472258 0.010785 0.482779
H  6.008005 -2.157387 1.644751
H  4.863741 -2.581533 0.388682
elementType: O N C H
totalener: -1094.86841133 hartree
nucrepener: 2085.54935432 hartree
electener: -3180.41776565 hartree
oneelecener: -5633.52008178 hartree
twoeener: 2453.10231613 hartree
cpcmener: -0.03757101 hartree
kineticenergy: 1090.04209001 hartree
xcener: -105.974214816899 hartree
chargesum: -0.0000000
charge: -0.286215 -0.485621 -0.434912 -0.440235 -0.095169 0.150397 -0.002660 -0.127012 -0.286064 -0.284822 -0.303333 0.416629 -0.016044 0.078157 -0.228437 -0.241889 -0.079725 -0.059701 -0.074413 -0.069194 -0.132758 -0.137023 0.345727 0.336947 0.104685 0.100623 0.093888 0.098412 0.096446 0.094005 0.098662 0.099119 0.124545 0.141694 0.126058 0.094994 0.089675 0.096595 0.099980 0.102949 0.083493 0.103090 0.093918 0.101813 0.094360 0.079985 0.078589 0.080802 0.078993
qa: -0.2862 -0.4856 -0.4349 -0.4402 -0.0952 0.1504 -0.0027 -0.1270 -0.2861 -0.2848 -0.3033 0.4166 -0.0160 0.0782 -0.2284 -0.2419 -0.0797 -0.0597 -0.0744 -0.0692 -0.1328 -0.1370 0.3457 0.3369 0.1047 0.1006 0.0939 0.0984 0.0964 0.0940 0.0987 0.0991 0.1245 0.1417 0.1261 0.0950 0.0897 0.0966 0.1000 0.1029 0.0835 0.1031 0.0939 0.1018 0.0944 0.0800 0.0786 0.0808 0.0790
va: 2.1030 2.0187 2.0765 2.0660 3.1030 3.6907 3.8057 3.8243 3.8921 3.9093 3.8928 4.1188 3.7141 3.8641 3.9295 3.9343 3.7115 3.6786 3.9193 3.9164 3.9140 3.9176 4.1950 4.1871 1.0235 1.0288 1.0156 1.0026 1.0046 1.0021 1.0022 1.0001 1.0033 1.0167 1.0146 0.9968 1.0062 0.9961 0.9986 0.9991 1.0120 1.0049 1.0154 1.0048 1.0151 1.0099 1.0066 1.0094 1.0065
dispcorr: -0.023383765 hartree
energy: -1094.891795094482
dipole: -15.56080 16.94254 1.38174 -15.33226 13.80674 -1.52553 -1.13253 0.55878 -0.57375
magnitude: 2.13673 au
magnitude: 5.43114 debye
