program: Orca
programVersion: 5.0.2
elementType: O O O O N C C C C C C C C C C C C C C C C C C C H H H H H H H H H H H H H H H H H H H H H H H H H
charge: 0
multiplicity: 1
keywords: wb97x-d3
keywords: def2-TZVPP
keywords: def2/J RIJCOSX
keywords: DEFGRID2
keywords: scfconv7
keywords: smallprint printgap noloewdin
keywords: NOSOSCF
formula: C19H25NO4
InChI: InChI=1/C19H25NO4/c1-11(2)9-14-15(19(14,3)4)18(23)24-10-20-16(21)12-7-5-6-8-13(12)17(20)22/h9,14-15H,5-8,10H2,1-4H3
49 atoms
O  -0.368125 1.17325 -0.052411
O  -1.461558 0.766624 1.865957
O  2.854099 2.625302 -1.202442
O  1.547657 -0.702341 1.598658
N  1.917795 1.195904 0.349482
C  -2.587759 -1.647676 0.216938
C  -3.614563 -0.567792 0.299584
C  -2.20802 -0.226511 -0.175704
C  -2.068842 -2.257043 1.496953
C  -2.617288 -2.634913 -0.924491
C  -4.756113 -0.462592 -0.633207
C  -1.340531 0.597075 0.675893
C  -5.777297 0.39336 -0.522615
C  0.682282 1.861654 0.611912
C  -6.901108 0.383447 -1.513668
C  -5.908042 1.424381 0.555701
C  3.921091 0.5426 -0.578666
C  3.536132 -0.438692 0.238737
C  5.182934 0.55874 -1.357354
C  4.2884 -1.692754 0.4808
C  6.115286 -0.537245 -0.837678
C  5.371576 -1.847575 -0.587938
C  2.881667 1.601318 -0.566725
C  2.233955 -0.063966 0.838505
H  -3.812182 -0.229132 1.311348
H  -2.080897 -0.070941 -1.240709
H  -2.631093 -3.166985 1.715627
H  -1.017675 -2.536943 1.401888
H  -2.16901 -1.602557 2.35934
H  -1.632523 -3.087254 -1.053542
H  -3.326156 -3.439387 -0.718788
H  -2.892278 -2.179998 -1.875172
H  -4.763777 -1.14815 -1.474873
H  0.507999 1.917817 1.683841
H  0.737589 2.871259 0.211843
H  -6.982677 1.346501 -2.024088
H  -6.778833 -0.391193 -2.270236
H  -7.859651 0.218905 -1.014506
H  -6.035525 2.416264 0.114675
H  -6.80055 1.241457 1.159685
H  -5.052538 1.470249 1.226568
H  4.956291 0.405842 -2.417063
H  5.657754 1.540012 -1.288836
H  4.730979 -1.661947 1.481294
H  3.60973 -2.548672 0.477485
H  6.925015 -0.694874 -1.55087
H  6.578535 -0.20175 0.09421
H  6.073248 -2.625825 -0.286076
H  4.909969 -2.184526 -1.52003
elementType: O N C H
totalener: -1094.86893307 hartree
nucrepener: 2071.60321511 hartree
electener: -3166.47214818 hartree
oneelecener: -5605.73464377 hartree
twoeener: 2439.26249559 hartree
cpcmener: -0.03801063 hartree
kineticenergy: 1090.04646826 hartree
xcener: -105.976114374186 hartree
chargesum: -0.0000000
charge: -0.289137 -0.485373 -0.434925 -0.441466 -0.094189 0.134019 -0.037144 -0.061099 -0.279082 -0.294822 -0.260288 0.405807 -0.026547 0.079605 -0.230857 -0.257372 -0.079799 -0.057872 -0.071417 -0.070691 -0.135722 -0.135585 0.344647 0.336929 0.102281 0.094840 0.099656 0.093933 0.094934 0.100065 0.103660 0.090691 0.122726 0.143641 0.125667 0.094881 0.089527 0.093899 0.095728 0.097911 0.086742 0.102528 0.093854 0.101508 0.093539 0.081357 0.078925 0.080922 0.078964
qa: -0.2891 -0.4854 -0.4349 -0.4415 -0.0942 0.1340 -0.0371 -0.0611 -0.2791 -0.2948 -0.2603 0.4058 -0.0265 0.0796 -0.2309 -0.2574 -0.0798 -0.0579 -0.0714 -0.0707 -0.1357 -0.1356 0.3446 0.3369 0.1023 0.0948 0.0997 0.0939 0.0949 0.1001 0.1037 0.0907 0.1227 0.1436 0.1257 0.0949 0.0895 0.0939 0.0957 0.0979 0.0867 0.1025 0.0939 0.1015 0.0935 0.0814 0.0789 0.0809 0.0790
va: 2.1062 2.0175 2.0778 2.0660 3.1015 3.7339 3.8361 3.7916 3.8848 3.9192 3.8916 4.1509 3.7287 3.8592 3.9278 3.9427 3.7146 3.6754 3.9175 3.9169 3.9143 3.9157 4.1961 4.1876 1.0183 1.0328 1.0016 1.0062 1.0164 1.0010 0.9991 1.0035 1.0078 1.0149 1.0160 0.9961 1.0078 0.9954 0.9971 0.9968 1.0134 1.0049 1.0152 1.0048 1.0155 1.0094 1.0066 1.0094 1.0067
dispcorr: -0.022621860 hartree
energy: -1094.891554929523
dipole: -18.33295 19.57822 1.24527 -13.66613 12.65562 -1.01051 -5.63965 4.41219 -1.22747
magnitude: 2.01953 au
magnitude: 5.13324 debye
