program: Orca
programVersion: 5.0.2
elementType: O O O O N C C C C C C C C C C C C C C C C C C C H H H H H H H H H H H H H H H H H H H H H H H H H
charge: 0
multiplicity: 1
keywords: wb97x-d3
keywords: def2-TZVPP
keywords: def2/J RIJCOSX
keywords: DEFGRID2
keywords: scfconv7
keywords: smallprint printgap noloewdin
keywords: NOSOSCF
formula: C19H25NO4
InChI: InChI=1/C19H25NO4/c1-11(2)9-14-15(19(14,3)4)18(23)24-10-20-16(21)12-7-5-6-8-13(12)17(20)22/h9,14-15H,5-8,10H2,1-4H3
49 atoms
O  -0.25526 0.375204 1.428375
O  -1.248836 -1.627363 1.616855
O  1.618717 -1.537539 -0.229965
O  2.986618 2.008059 2.257063
N  2.043855 0.134884 1.293151
C  -2.558252 -0.632016 -1.074547
C  -3.554893 -0.593777 0.0438
C  -2.213397 0.067941 0.234526
C  -1.92269 -1.950901 -1.437363
C  -2.765056 0.272392 -2.263964
C  -4.775332 0.247575 -0.020555
C  -1.222286 -0.513575 1.155972
C  -6.00206 -0.201761 -0.299477
C  0.904055 -0.049326 2.131436
C  -7.179474 0.724066 -0.332644
C  -6.314257 -1.634101 -0.606281
C  3.490296 -0.018541 -0.492897
C  3.901682 1.007981 0.252944
C  4.136791 -0.475427 -1.747303
C  5.099507 1.838089 -0.021686
C  5.132672 0.584315 -2.223258
C  5.968131 1.142116 -1.071454
C  2.286234 -0.607318 0.144921
C  2.968894 1.166347 1.396626
H  -3.666012 -1.537434 0.570268
H  -2.192117 1.151096 0.174117
H  -0.91754 -1.808871 -1.83975
H  -1.85608 -2.64244 -0.600256
H  -2.518555 -2.437889 -2.212315
H  -3.456939 -0.185913 -2.974213
H  -3.172695 1.245322 -1.990338
H  -1.821326 0.44397 -2.785544
H  -4.648717 1.309629 0.170773
H  0.826334 -1.08998 2.439403
H  1.018113 0.573983 3.015839
H  -7.941256 0.417545 0.389583
H  -6.900479 1.753968 -0.109086
H  -7.662479 0.71036 -1.313419
H  -7.049561 -2.032387 0.098309
H  -6.763111 -1.722333 -1.599312
H  -5.441436 -2.284794 -0.582015
H  4.640717 -1.431109 -1.569228
H  3.381359 -0.673071 -2.511941
H  4.785479 2.827776 -0.36953
H  5.661553 2.008754 0.899961
H  5.783775 0.155847 -2.986545
H  4.586066 1.402248 -2.701772
H  6.712139 1.843131 -1.452539
H  6.521526 0.32657 -0.596594
elementType: O N C H
totalener: -1094.87884322 hartree
nucrepener: 2071.46307987 hartree
electener: -3166.34192310 hartree
oneelecener: -5605.31157823 hartree
twoeener: 2438.96965513 hartree
cpcmener: -0.03084461 hartree
kineticenergy: 1090.04213556 hartree
xcener: -105.970977615794 hartree
chargesum: -0.0000000
charge: -0.282549 -0.452361 -0.413435 -0.409676 -0.093250 0.155345 -0.011612 -0.124515 -0.298163 -0.266591 -0.260522 0.393217 -0.033666 0.080607 -0.227412 -0.250609 -0.060787 -0.079983 -0.071145 -0.075437 -0.136281 -0.134480 0.315449 0.323308 0.097985 0.092294 0.093413 0.097492 0.097891 0.096260 0.090546 0.098847 0.119826 0.141622 0.124071 0.093941 0.088414 0.093057 0.097850 0.095732 0.087790 0.100491 0.094278 0.101178 0.093413 0.080906 0.078308 0.080702 0.078240
qa: -0.2825 -0.4524 -0.4134 -0.4097 -0.0933 0.1553 -0.0116 -0.1245 -0.2982 -0.2666 -0.2605 0.3932 -0.0337 0.0806 -0.2274 -0.2506 -0.0608 -0.0800 -0.0711 -0.0754 -0.1363 -0.1345 0.3154 0.3233 0.0980 0.0923 0.0934 0.0975 0.0979 0.0963 0.0905 0.0988 0.1198 0.1416 0.1241 0.0939 0.0884 0.0931 0.0978 0.0957 0.0878 0.1005 0.0943 0.1012 0.0934 0.0809 0.0783 0.0807 0.0782
va: 2.1097 2.0581 2.1001 2.1094 3.0935 3.6651 3.7965 3.8826 3.8931 3.9045 3.8691 4.1940 3.7064 3.8572 3.9275 3.9420 3.6667 3.6948 3.9197 3.9201 3.9148 3.9126 4.2130 4.2249 1.0250 1.0368 1.0085 1.0168 1.0026 1.0027 1.0025 1.0029 1.0076 1.0156 1.0159 0.9956 1.0079 0.9964 0.9983 0.9974 1.0087 1.0052 1.0150 1.0055 1.0156 1.0094 1.0065 1.0096 1.0067
dispcorr: -0.023208235 hartree
energy: -1094.902051458247
dipole: -20.70335 21.71875 1.01540 -1.02880 1.87325 0.84445 -19.36185 17.73883 -1.62302
magnitude: 2.09245 au
magnitude: 5.31857 debye
