program: Orca
programVersion: 5.0.2
elementType: O O O O N C C C C C C C C C C C C C C C C C C C H H H H H H H H H H H H H H H H H H H H H H H H H
charge: 0
multiplicity: 1
keywords: wb97x-d3
keywords: def2-TZVPP
keywords: def2/J RIJCOSX
keywords: DEFGRID2
keywords: scfconv7
keywords: smallprint printgap noloewdin
keywords: NOSOSCF
formula: C19H25NO4
InChI: InChI=1/C19H25NO4/c1-11(2)9-14-15(19(14,3)4)18(23)24-10-20-16(21)12-7-5-6-8-13(12)17(20)22/h9,14-15H,5-8,10H2,1-4H3
49 atoms
O  -0.493556 1.48224 0.869789
O  -1.306585 2.326987 -1.043673
O  1.371864 0.572759 -1.647661
O  2.62568 1.078374 2.687732
N  1.786046 1.161025 0.540488
C  -4.013693 1.191997 0.081137
C  -3.459759 0.281733 -0.959087
C  -2.570063 0.716188 0.189703
C  -4.32694 2.622732 -0.279173
C  -4.947994 0.626331 1.123195
C  -3.887541 -1.136186 -1.079487
C  -1.425947 1.596749 -0.091345
C  -3.076171 -2.174888 -1.293448
C  0.757102 2.135072 0.707392
C  -3.611504 -3.569307 -1.409758
C  -1.588227 -2.0517 -1.419891
C  3.053143 -0.557756 -0.322093
C  3.413865 -0.415034 0.953894
C  3.639041 -1.534669 -1.271424
C  4.447687 -1.222987 1.644805
C  4.940239 -2.088306 -0.689012
C  4.797203 -2.443252 0.790308
C  1.980775 0.422645 -0.619408
C  2.602538 0.673045 1.554795
H  -3.220802 0.772924 -1.900122
H  -2.390475 -0.021018 0.963924
H  -3.713271 3.006537 -1.091011
H  -5.36913 2.698695 -0.596851
H  -4.199208 3.282038 0.581925
H  -4.92317 1.232598 2.030579
H  -5.976985 0.625682 0.757455
H  -4.695348 -0.396514 1.403192
H  -4.956127 -1.322954 -1.010373
H  0.957385 2.701239 1.614322
H  0.747691 2.817682 -0.139519
H  -3.380789 -3.997912 -2.388489
H  -3.150712 -4.228696 -0.669233
H  -4.691708 -3.610761 -1.270291
H  -1.227893 -2.621197 -2.279757
H  -1.246474 -1.025403 -1.538556
H  -1.087597 -2.471087 -0.54246
H  2.918931 -2.339744 -1.451048
H  3.813058 -1.065064 -2.242528
H  5.333064 -0.603699 1.820249
H  4.094011 -1.527557 2.632638
H  5.249668 -2.967108 -1.256498
H  5.732798 -1.344014 -0.808876
H  5.72033 -2.893427 1.157999
H  4.014546 -3.198656 0.905606
elementType: O N C H
totalener: -1094.87834137 hartree
nucrepener: 2117.02702049 hartree
electener: -3211.90536186 hartree
oneelecener: -5696.38190549 hartree
twoeener: 2484.47654363 hartree
cpcmener: -0.03112612 hartree
kineticenergy: 1090.05325577 hartree
xcener: -105.973246726901 hartree
chargesum: 0.0000000
charge: -0.283839 -0.457023 -0.411467 -0.408894 -0.096508 0.143978 -0.003270 -0.120462 -0.281517 -0.282024 -0.303949 0.391590 -0.007894 0.080396 -0.229597 -0.233890 -0.055117 -0.081921 -0.075534 -0.068804 -0.133277 -0.138003 0.312005 0.320413 0.104160 0.096635 0.094506 0.093916 0.098347 0.098069 0.097812 0.092631 0.120959 0.124609 0.138881 0.096670 0.093967 0.088837 0.100940 0.075582 0.101033 0.101094 0.094291 0.100319 0.093585 0.081255 0.077598 0.080774 0.078137
qa: -0.2838 -0.4570 -0.4115 -0.4089 -0.0965 0.1440 -0.0033 -0.1205 -0.2815 -0.2820 -0.3039 0.3916 -0.0079 0.0804 -0.2296 -0.2339 -0.0551 -0.0819 -0.0755 -0.0688 -0.1333 -0.1380 0.3120 0.3204 0.1042 0.0966 0.0945 0.0939 0.0983 0.0981 0.0978 0.0926 0.1210 0.1246 0.1389 0.0967 0.0940 0.0888 0.1009 0.0756 0.1010 0.1011 0.0943 0.1003 0.0936 0.0813 0.0776 0.0808 0.0781
va: 2.1051 2.0500 2.0990 2.1097 3.0993 3.6997 3.7979 3.8037 3.8968 3.9068 3.8943 4.1645 3.7143 3.8663 3.9321 3.9378 3.6619 3.6932 3.9235 3.9175 3.9122 3.9178 4.2064 4.2258 1.0267 1.0298 1.0179 1.0009 0.9992 1.0031 1.0006 1.0025 1.0043 1.0148 1.0171 0.9963 0.9963 1.0065 1.0017 1.0126 0.9976 1.0052 1.0153 1.0050 1.0155 1.0095 1.0070 1.0094 1.0065
dispcorr: -0.024038090 hartree
energy: -1094.902379458531
dipole: -14.99675 15.94258 0.94583 -17.39231 15.55323 -1.83908 -4.07726 4.57581 0.49855
magnitude: 2.12729 au
magnitude: 5.40713 debye
