program: Gaussian 09
title: 000067954
version: EM64L-G09RevD.01
frameworkgroup: C1[X(C18H17N)]
method: RPBEPBE
basis: SDD
operation: Freq
keyword: #pfreq=noraman
keyword: PBEPBE/SDD
title: #p freq=noraman PBEPBE/SDD
converged: YES YES NO NO
title: Mulliken charges:
elementType: N C C C C C C C C C C C C C C C C C C H H H H H H H H H H H H H H H H H
charge: -0.148482 0.094777 0.324663 0.330831 -0.421848 0.502917 -0.376590 -0.459225 0.400373 -0.386743 -0.431365 -0.439644 -0.357417 -0.371576 -0.373439 -0.254010 -0.242190 -0.644996 -0.645830 0.214857 0.222315 0.244149 0.226856 0.240534 0.225380 0.222363 0.237907 0.236675 0.219479 0.219832 0.219001 0.238067 0.237293 0.236959 0.238909 0.219220
chargesum: 0.00000
title: Mulliken charges with hydrogens summed into heavy atoms:
elementType: N C C C C C C C C C C C C C C C C C C
charge: -0.148482 0.094777 0.324663 0.330831 -0.206991 0.502917 -0.154275 -0.215076 0.400373 -0.159886 -0.190831 -0.214264 -0.135054 -0.133669 -0.136764 -0.034532 -0.022358 0.049365 0.049258
polarizability: 5.33750281e+02 -6.43972604e+00 1.99487453e+02 -6.15488266e-01 -1.23618292e+00 8.98225829e+01
1716.lowfreq: -3.8939 -0.0004 0.0002 0.0004 5.4612 9.1112 20.5573 33.4628 64.2007
frequency: 20.5497 33.4428 64.1848 80.3124 95.0760 118.4122 151.6545 165.5090 198.8333 207.7878 213.4454 256.0711 297.3023 324.3471 386.2612 389.2523 418.5647 436.3979 440.3823 471.8195 523.2932 526.6141 554.1245 568.1540 611.1024 631.7594 654.6676 712.2895 724.2877 731.4482 750.2892 759.6793 792.0354 797.0095 804.0382 820.6256 834.4705 853.7874 874.9942 914.0630 919.9636 940.5115 941.9441 952.4721 958.3247 975.5401 993.6617 1016.9220 1030.7689 1056.2996 1075.1852 1107.0063 1111.1206 1114.4051 1138.6060 1165.9848 1167.4296 1195.5118 1204.6811 1211.1961 1258.4277 1263.7810 1284.0317 1322.0224 1327.9995 1363.2163 1371.0711 1393.5002 1416.2791 1430.6320 1444.4736 1451.0068 1458.0612 1459.7858 1464.6825 1476.6049 1493.2440 1503.7012 1508.5921 1530.9216 1545.6584 1589.6747 1611.2712 1613.0069 1639.2232 2944.9105 2952.0060 3012.5195 3015.0988 3072.5683 3099.8153 3109.5282 3113.9930 3118.9549 3123.1083 3137.5054 3154.4587 3157.4335 3163.0319 3171.8903 3181.7859 3214.5374
redmass: 3.6720 4.6712 3.0794 2.8924 4.0681 1.6308 4.1723 2.7471 1.2226 2.9646 3.8466 2.8992 3.8870 3.8087 3.7010 3.2544 2.9227 3.2522 3.4508 3.6101 2.5988 3.3116 5.5297 3.1905 6.2630 6.9588 2.5230 4.9185 5.3090 2.7553 2.6389 1.3278 4.5897 1.7088 1.3857 1.8391 5.0389 4.7125 1.4829 1.4520 1.3661 1.4513 2.9951 1.4305 1.4078 1.3245 2.9738 2.4900 2.4095 1.5041 1.7101 1.2373 1.3243 1.3257 1.5356 1.3068 1.3591 2.0689 1.4631 1.4129 2.8582 1.6242 2.2912 1.6376 1.6392 2.9797 3.8159 2.9922 2.2741 1.2457 2.7560 2.7528 3.4039 1.2920 1.0418 1.0459 1.1120 1.9182 1.7144 2.7391 5.8544 6.5929 6.5131 7.3816 6.6499 1.0368 1.0393 1.0993 1.1030 1.0866 1.0963 1.0944 1.0859 1.0889 1.0883 1.0941 1.0870 1.1001 1.0934 1.0911 1.0951 1.1000
irintensity: 0.1565 1.2577 0.1727 0.3155 0.8645 3.7713 0.3112 0.2725 0.6562 3.4354 1.3833 1.4194 0.4142 0.4075 0.4265 2.6500 2.1009 8.5496 5.8813 2.6510 24.6880 18.2565 11.1611 0.3506 2.1670 0.4419 2.4671 1.0350 25.9970 11.4827 5.0756 88.7651 4.5088 20.0947 4.5460 84.0501 8.6404 15.5335 1.5184 17.4413 3.1269 5.6820 30.2815 2.5920 5.0608 0.0435 1.6276 24.8055 31.0649 24.8213 17.3740 0.0051 1.2695 13.6987 4.5877 25.0715 0.7052 2.1287 158.7864 17.0941 24.8980 20.5479 1.8944 7.8232 7.8490 74.8369 277.6621 26.6589 11.6198 4.4925 31.7951 6.0298 127.7194 79.8417 0.8844 23.1263 4.2304 31.3476 16.4152 385.4814 2.4394 7.4159 496.0187 261.4227 101.9268 95.8511 198.7555 0.5151 82.1162 14.9970 4.0172 51.3052 4.6537 10.2848 1.3155 36.5076 12.5218 64.4044 29.1596 8.9818 6.6089 13.4685
temp: 298.150 k
press: 1.00000 atm
elementType: 7 6 6 6 6 6 6 6 6 6 6 6 6 6 6 6 6 6 6 1 1 1 1 1 1 1 1 1 1 1 1 1 1 1 1 1
symmnumber: 1
zpe: 774282.3 jmol-1
zpe.correction: 0.294909 hartree
zpe.thermalcorrener: 0.311499 hartree
zpe.thermalcorrenthalpy: 0.312443 hartree
zpe.thermalcorrgfe: 0.249415 hartree
zpe.sumelectzpe: -749.522041 hartree
zpe.sumelectthermal: -749.505451 hartree
zpe.sumelectthermalent: -749.504507 hartree
zpe.sumelectthermalfe: -749.567535 hartree
dipole: 6.6142 -0.0744 0.0255
dipole: 6.6147
quadrupole: -78.8984 -98.4590 -121.1858
quadrupole: 0.9262 -0.2026 0.5131
quadrupole: 20.6160 1.0554 -21.6714 0.9262 -0.2026 0.5131
hfenergy: -749.81695 hartree
pointgroup: C01 [X(C18H17N1)]
dipole: 2.600374 -0.006855 -0.1028822 debye
polarizability: 532.9982427|1.3886129|123.8620437|-17.9254948|50.7029152|166.2000309 unknown
InChI: InChI=1S/C18H17N/c1-19(2)17-11-7-14(8-12-17)13-16-10-9-15-5-3-4-6-18(15)16/h3-13H,1-2H3
charge 0 multiplicity 1
36 atoms
N  5.279774 0.102036 -0.079402
C  -2.931751 -0.125097 -0.076121
C  -1.507499 0.194171 0.218234
C  -3.74983 0.600746 0.856986
C  -0.442022 -0.326904 -0.499941
C  0.999565 -0.194854 -0.328438
C  -1.539974 1.141211 1.349114
C  -2.853424 1.382337 1.719679
C  3.891226 -0.002832 -0.160473
C  -3.529514 -0.963883 -1.036473
C  -5.15561 0.487346 0.823353
C  1.852364 -0.632866 -1.389629
C  1.652637 0.314992 0.837136
C  3.24846 -0.539089 -1.324149
C  3.047363 0.40832 0.924855
C  -4.943337 -1.073049 -1.070375
C  -5.748506 -0.355407 -0.149472
C  6.118781 -0.343985 -1.200188
C  5.910555 0.651575 1.128611
H  -0.723647 -0.94673 -1.366107
H  -0.669018 1.622773 1.792667
H  -3.183772 2.056862 2.513458
H  -2.924077 -1.531109 -1.753838
H  -5.781227 1.038385 1.535057
H  1.39364 -1.048147 -2.296179
H  1.059539 0.605455 1.707744
H  3.84258 -0.884987 -2.174421
H  3.488835 0.792086 1.84888
H  -5.420098 -1.720156 -1.815521
H  -6.839087 -0.456643 -0.192496
H  7.17832 -0.169107 -0.957073
H  5.886925 0.21114 -2.131418
H  5.989851 -1.425977 -1.405856
H  5.685274 0.040722 2.026212
H  5.577146 1.689708 1.328348
H  7.003557 0.666958 0.996337
