program: Orca
programVersion: 5.0.2
elementType: O O O O N C C C C C C C C C C C C C C C C C C C H H H H H H H H H H H H H H H H H H H H H H H H H
charge: 0
multiplicity: 1
keywords: wb97x-d3
keywords: def2-TZVPP
keywords: def2/J RIJCOSX
keywords: DEFGRID2
keywords: scfconv7
keywords: smallprint printgap noloewdin
keywords: NOSOSCF
formula: C19H25NO4
InChI: InChI=1/C19H25NO4/c1-11(2)9-14-15(19(14,3)4)18(23)24-10-20-16(21)12-7-5-6-8-13(12)17(20)22/h9,14-15H,5-8,10H2,1-4H3
49 atoms
O  -0.599503 1.16766 0.716743
O  -1.847659 2.618895 1.853777
O  2.236079 2.418831 -0.872641
O  1.583524 -0.98826 2.058956
N  1.675856 0.949065 0.814179
C  -3.016475 0.932447 -1.169443
C  -2.927077 -0.245321 -0.248035
C  -2.923764 1.16438 0.32909
C  -1.846971 1.223914 -2.078955
C  -4.34058 1.297361 -1.799297
C  -4.059387 -1.144217 0.040341
C  -1.761806 1.731289 1.036299
C  -3.947098 -2.443431 0.334502
C  0.572091 1.641195 1.377319
C  -5.159213 -3.282568 0.599119
C  -2.624638 -3.160202 0.412805
C  3.365635 0.295448 -0.606268
C  3.163724 -0.713545 0.242664
C  4.397535 0.323587 -1.671006
C  3.914857 -1.992441 0.242473
C  5.403012 -0.804892 -1.433795
C  4.71334 -2.115658 -1.057028
C  2.395622 1.373956 -0.297631
C  2.066198 -0.338156 1.168594
H  -1.955561 -0.726991 -0.249355
H  -3.853285 1.486892 0.785293
H  -1.7382 2.297181 -2.249128
H  -0.899374 0.843733 -1.704936
H  -2.020647 0.755936 -3.050339
H  -4.326216 2.336245 -2.135001
H  -4.536522 0.671799 -2.672728
H  -5.183659 1.189827 -1.117863
H  -5.053294 -0.708144 0.012567
H  0.51647 1.436001 2.446361
H  0.702714 2.712325 1.225572
H  -6.085012 -2.715287 0.50088
H  -5.209173 -4.130143 -0.090271
H  -5.129215 -3.708354 1.605971
H  -1.892148 -2.621676 1.016107
H  -2.740487 -4.149918 0.855049
H  -2.181716 -3.305219 -0.575474
H  3.914448 0.216299 -2.64764
H  4.897328 1.295124 -1.68855
H  4.5793 -2.02178 1.112075
H  3.228971 -2.835025 0.360168
H  6.010896 -0.945786 -2.328697
H  6.088549 -0.512653 -0.633144
H  5.452858 -2.911345 -0.956553
H  4.040233 -2.415271 -1.865494
elementType: O N C H
totalener: -1094.87820492 hartree
nucrepener: 2102.63650025 hartree
electener: -3197.51470516 hartree
oneelecener: -5666.86725170 hartree
twoeener: 2469.35254654 hartree
cpcmener: -0.03148298 hartree
kineticenergy: 1090.03637005 hartree
xcener: -105.969442712617 hartree
chargesum: 0.0000000
charge: -0.269480 -0.467368 -0.408745 -0.410865 -0.108227 0.094771 0.067115 -0.092354 -0.269263 -0.282212 -0.311470 0.403475 -0.000732 0.075279 -0.226011 -0.289837 -0.062156 -0.064622 -0.073246 -0.069369 -0.135056 -0.136946 0.305276 0.314664 0.097764 0.088347 0.100590 0.084724 0.095090 0.097489 0.097922 0.090329 0.113494 0.135760 0.128201 0.084533 0.098046 0.094935 0.099040 0.095441 0.106875 0.101456 0.094185 0.100545 0.094151 0.080851 0.078205 0.080850 0.078558
qa: -0.2695 -0.4674 -0.4087 -0.4109 -0.1082 0.0948 0.0671 -0.0924 -0.2693 -0.2822 -0.3115 0.4035 -0.0007 0.0753 -0.2260 -0.2898 -0.0622 -0.0646 -0.0732 -0.0694 -0.1351 -0.1369 0.3053 0.3147 0.0978 0.0883 0.1006 0.0847 0.0951 0.0975 0.0979 0.0903 0.1135 0.1358 0.1282 0.0845 0.0980 0.0949 0.0990 0.0954 0.1069 0.1015 0.0942 0.1005 0.0942 0.0809 0.0782 0.0808 0.0786
va: 2.0990 2.0384 2.1044 2.1004 3.1349 3.7058 3.7386 3.8460 3.9111 3.9195 3.9139 4.1629 3.6951 3.9007 3.9249 3.9432 3.6777 3.6796 3.9209 3.9175 3.9149 3.9155 4.1957 4.1989 1.0145 1.0316 1.0004 1.0124 1.0004 1.0011 1.0005 1.0073 1.0131 1.0002 1.0064 1.0101 0.9924 0.9933 1.0008 1.0041 0.9940 1.0053 1.0152 1.0050 1.0150 1.0097 1.0067 1.0096 1.0066
dispcorr: -0.023029276 hartree
energy: -1094.901234193665
dipole: -12.55500 13.99337 1.43837 -17.45491 15.61582 -1.83909 -13.28446 11.73627 -1.54819
magnitude: 2.80144 au
magnitude: 7.12068 debye
