program: Orca
programVersion: 5.0.2
elementType: O O O O N C C C C C C C C C C C C C C C C C C C H H H H H H H H H H H H H H H H H H H H H H H H H
charge: 0
multiplicity: 1
keywords: wb97x-d3
keywords: def2-TZVPP
keywords: def2/J RIJCOSX
keywords: DEFGRID2
keywords: scfconv7
keywords: smallprint printgap noloewdin
keywords: NOSOSCF
formula: C19H25NO4
InChI: InChI=1/C19H25NO4/c1-11(2)9-14-15(19(14,3)4)18(23)24-10-20-16(21)12-7-5-6-8-13(12)17(20)22/h9,14-15H,5-8,10H2,1-4H3
49 atoms
O  -0.647614 0.689407 1.326194
O  -0.780158 2.561621 0.108792
O  2.36265 2.776486 0.235201
O  1.628627 -1.549813 1.426213
N  1.690495 0.723278 1.060858
C  -2.327683 -0.261469 -1.203282
C  -2.999977 -0.454951 0.128538
C  -2.418351 0.89371 -0.221141
C  -1.004538 -0.95031 -1.436112
C  -3.159769 -0.137739 -2.455635
C  -4.464757 -0.588391 0.272217
C  -1.213655 1.475314 0.403515
C  -5.104364 -1.567085 0.920513
C  0.592377 1.086276 1.897331
C  -6.599463 -1.568319 1.033605
C  -4.426245 -2.719111 1.599445
C  3.411477 0.715319 -0.469772
C  3.198469 -0.555175 -0.125645
C  4.446076 1.176928 -1.426885
C  3.943793 -1.722316 -0.657569
C  5.439026 0.043065 -1.69184
C  4.735551 -1.298124 -1.896015
C  2.456728 1.578137 0.273027
C  2.100665 -0.592034 0.869211
H  -2.413448 -1.035607 0.831233
H  -3.124475 1.665055 -0.511691
H  -0.342833 -0.342588 -2.057633
H  -0.480181 -1.188929 -0.512933
H  -1.168456 -1.893977 -1.96034
H  -3.431107 -1.125296 -2.834734
H  -4.081117 0.421698 -2.298016
H  -2.596983 0.37273 -3.239857
H  -5.064926 0.195127 -0.182098
H  0.65534 0.550077 2.840955
H  0.628521 2.155724 2.09661
H  -7.028181 -2.460479 0.569168
H  -6.912803 -1.586879 2.081196
H  -7.051346 -0.694203 0.56468
H  -3.379068 -2.83577 1.325394
H  -4.474616 -2.615037 2.687509
H  -4.933187 -3.656778 1.358886
H  3.961543 1.494628 -2.355853
H  4.95673 2.060847 -1.03748
H  4.612541 -2.108676 0.118413
H  3.255439 -2.537386 -0.893436
H  6.044149 0.285073 -2.566667
H  6.128819 -0.034398 -0.846449
H  5.465052 -2.069761 -2.14594
H  4.054729 -1.223272 -2.748773
elementType: O N C H
totalener: -1094.87826410 hartree
nucrepener: 2123.68850843 hartree
electener: -3218.56677252 hartree
oneelecener: -5709.48148255 hartree
twoeener: 2490.91471003 hartree
cpcmener: -0.03481363 hartree
kineticenergy: 1090.03082361 hartree
xcener: -105.969210088402 hartree
chargesum: -0.0000000
charge: -0.270180 -0.447187 -0.398618 -0.407138 -0.073944 0.108618 0.078490 -0.136783 -0.278884 -0.272429 -0.307674 0.408106 -0.025910 0.053586 -0.222418 -0.263978 -0.069884 -0.035335 -0.071244 -0.073773 -0.137287 -0.136345 0.309017 0.257800 0.094165 0.094817 0.102490 0.084173 0.099361 0.095371 0.087514 0.098732 0.117008 0.139220 0.131774 0.093279 0.092823 0.087356 0.092424 0.101313 0.092708 0.101695 0.093943 0.100510 0.093890 0.081065 0.078175 0.080912 0.078675
qa: -0.2702 -0.4472 -0.3986 -0.4071 -0.0739 0.1086 0.0785 -0.1368 -0.2789 -0.2724 -0.3077 0.4081 -0.0259 0.0536 -0.2224 -0.2640 -0.0699 -0.0353 -0.0712 -0.0738 -0.1373 -0.1363 0.3090 0.2578 0.0942 0.0948 0.1025 0.0842 0.0994 0.0954 0.0875 0.0987 0.1170 0.1392 0.1318 0.0933 0.0928 0.0874 0.0924 0.1013 0.0927 0.1017 0.0939 0.1005 0.0939 0.0811 0.0782 0.0809 0.0787
va: 2.1165 2.0573 2.1166 2.1014 3.0636 3.7022 3.7114 3.8648 3.9140 3.9072 3.8802 4.1974 3.7358 3.9186 3.9267 3.9448 3.6669 3.6483 3.9156 3.9186 3.9157 3.9138 4.2052 4.2152 1.0270 1.0321 1.0001 1.0153 1.0021 1.0024 1.0052 1.0013 1.0110 1.0006 1.0166 0.9965 0.9949 1.0091 1.0071 0.9952 0.9986 1.0050 1.0157 1.0050 1.0152 1.0095 1.0063 1.0096 1.0070
dispcorr: -0.024481246 hartree
energy: -1094.902745341564
dipole: -16.14039 16.93590 0.79552 -16.87030 15.11381 -1.75650 -11.10523 10.42624 -0.67899
magnitude: 2.04430 au
magnitude: 5.19619 debye
