program: Orca
programVersion: 5.0.2
elementType: O O O O N C C C C C C C C C C C C C C C C C C C H H H H H H H H H H H H H H H H H H H H H H H H H
charge: 0
multiplicity: 1
keywords: wb97x-d3
keywords: def2-TZVPP
keywords: def2/J RIJCOSX
keywords: DEFGRID2
keywords: scfconv7
keywords: smallprint printgap noloewdin
keywords: NOSOSCF
formula: C19H25NO4
InChI: InChI=1/C19H25NO4/c1-11(2)9-14-15(19(14,3)4)18(23)24-10-20-16(21)12-7-5-6-8-13(12)17(20)22/h9,14-15H,5-8,10H2,1-4H3
49 atoms
O  -0.631388 0.451802 1.262348
O  -1.629439 2.455941 1.158212
O  2.439239 -1.234394 1.865523
O  1.345067 2.529416 -0.428583
N  1.658979 0.764251 1.018842
C  -2.354884 -0.027725 -1.299771
C  -2.768968 -0.863058 -0.135821
C  -2.637111 0.638411 0.04111
C  -0.941027 -0.14708 -1.817505
C  -3.354405 0.281163 -2.388426
C  -4.105553 -1.503969 -0.036584
C  -1.59843 1.286855 0.860129
C  -4.669735 -1.902982 1.106441
C  0.539875 0.973881 1.875941
C  -6.008133 -2.575784 1.124775
C  -4.028583 -1.717094 2.447155
C  3.380536 -0.243977 -0.132012
C  3.063173 0.862887 -0.805606
C  4.451679 -1.197326 -0.510182
C  3.739938 1.334065 -2.038791
C  4.900225 -0.91821 -1.946135
C  5.057829 0.577683 -2.215474
C  2.478279 -0.359147 1.040176
C  1.93468 1.529249 -0.10928
H  -1.959809 -1.433823 0.310252
H  -3.566463 1.196698 0.066561
H  -0.236466 -0.502597 -1.068233
H  -0.915551 -0.861769 -2.642929
H  -0.578306 0.8078 -2.20324
H  -3.070741 1.192398 -2.918685
H  -3.389111 -0.527741 -3.121559
H  -4.364498 0.427978 -2.00603
H  -4.64128 -1.679393 -0.965206
H  0.698625 0.427498 2.802806
H  0.437882 2.032761 2.10275
H  -6.428507 -2.68487 0.124898
H  -5.942674 -3.571137 1.572544
H  -6.722431 -2.0124 1.731177
H  -4.697724 -1.177659 3.122865
H  -3.830707 -2.683253 2.919787
H  -3.088222 -1.169525 2.405149
H  5.28987 -1.092081 0.186368
H  4.100525 -2.226582 -0.403275
H  3.079802 1.170915 -2.897012
H  3.910666 2.412207 -1.992114
H  5.841126 -1.434715 -2.141303
H  4.164977 -1.33554 -2.640236
H  5.437999 0.737757 -3.225406
H  5.803955 0.992079 -1.531245
elementType: O N C H
totalener: -1094.87667658 hartree
nucrepener: 2132.82258863 hartree
electener: -3227.69926521 hartree
oneelecener: -5727.48385511 hartree
twoeener: 2499.78458990 hartree
cpcmener: -0.03290272 hartree
kineticenergy: 1090.03560722 hartree
xcener: -105.970094414132 hartree
chargesum: 0.0000000
charge: -0.274952 -0.450505 -0.408404 -0.400295 -0.082105 0.156631 0.001046 -0.117001 -0.267847 -0.300842 -0.306038 0.400681 -0.006305 0.061070 -0.228977 -0.246825 -0.076057 -0.025571 -0.068801 -0.071771 -0.137369 -0.135235 0.321011 0.249063 0.106245 0.092471 0.076539 0.099462 0.099696 0.100164 0.099150 0.091439 0.123411 0.125698 0.139909 0.088717 0.094297 0.094650 0.095271 0.100656 0.078923 0.100690 0.093117 0.101100 0.094787 0.081000 0.078686 0.081418 0.077900
qa: -0.2750 -0.4505 -0.4084 -0.4003 -0.0821 0.1566 0.0010 -0.1170 -0.2678 -0.3008 -0.3060 0.4007 -0.0063 0.0611 -0.2290 -0.2468 -0.0761 -0.0256 -0.0688 -0.0718 -0.1374 -0.1352 0.3210 0.2491 0.1062 0.0925 0.0765 0.0995 0.0997 0.1002 0.0991 0.0914 0.1234 0.1257 0.1399 0.0887 0.0943 0.0946 0.0953 0.1007 0.0789 0.1007 0.0931 0.1011 0.0948 0.0810 0.0787 0.0814 0.0779
va: 2.0819 2.0580 2.1094 2.1075 3.0869 3.7208 3.7844 3.8268 3.8836 3.9138 3.8817 4.1581 3.7065 3.8844 3.9304 3.9412 3.6984 3.6073 3.9176 3.9205 3.9165 3.9150 4.2003 4.2261 1.0199 1.0296 1.0131 1.0029 1.0050 1.0017 0.9989 1.0014 1.0033 1.0113 1.0198 1.0068 0.9958 0.9964 0.9990 0.9984 1.0183 1.0048 1.0160 1.0057 1.0155 1.0095 1.0067 1.0093 1.0068
dispcorr: -0.025144012 hartree
energy: -1094.901820590585
dipole: -13.56878 14.81817 1.24939 -13.34134 11.82946 -1.51188 -11.87541 10.61807 -1.25735
magnitude: 2.32974 au
magnitude: 5.92172 debye
