program: Orca
programVersion: 5.0.2
elementType: O O O O N C C C C C C C C C C C C C C C C C C C H H H H H H H H H H H H H H H H H H H H H H H H H
charge: 0
multiplicity: 1
keywords: wb97x-d3
keywords: def2-TZVPP
keywords: def2/J RIJCOSX
keywords: DEFGRID2
keywords: scfconv7
keywords: smallprint printgap noloewdin
keywords: NOSOSCF
formula: C19H25NO4
InChI: InChI=1/C19H25NO4/c1-11(2)9-14-15(19(14,3)4)18(23)24-10-20-16(21)12-7-5-6-8-13(12)17(20)22/h9,14-15H,5-8,10H2,1-4H3
49 atoms
O  -0.675917 1.041454 1.188218
O  -1.573211 2.961642 0.460324
O  2.209133 -0.642858 2.203216
O  1.477233 2.495412 -0.996397
N  1.624542 1.139491 0.861155
C  -2.464073 -0.025857 -1.163113
C  -2.834855 -0.553103 0.194467
C  -2.697341 0.939032 -0.012739
C  -1.063266 -0.271358 -1.672628
C  -3.494256 -0.007944 -2.265518
C  -4.170835 -1.107746 0.494597
C  -1.609076 1.759523 0.553927
C  -4.431679 -2.271451 1.099601
C  0.531852 1.660755 1.612121
C  -5.845097 -2.697355 1.362815
C  -3.393915 -3.247107 1.566094
C  3.252732 -0.274359 0.050863
C  3.043909 0.651276 -0.886719
C  4.237251 -1.379536 -0.043915
C  3.774384 0.74123 -2.174319
C  4.725322 -1.506772 -1.48851
C  5.020353 -0.144716 -2.115563
C  2.336687 -0.009719 1.18766
C  1.97368 1.564818 -0.416024
H  -2.010862 -1.018563 0.722435
H  -3.622521 1.500931 -0.088248
H  -0.34295 -0.459166 -0.878346
H  -1.057664 -1.14976 -2.321315
H  -0.704932 0.572753 -2.265822
H  -3.215889 0.712386 -3.03754
H  -3.56289 -0.989384 -2.739961
H  -4.490182 0.259436 -1.914002
H  -5.017902 -0.494315 0.200235
H  0.673611 1.415156 2.662034
H  0.491166 2.742408 1.504149
H  -6.570532 -1.960176 1.018424
H  -6.069829 -3.646545 0.868809
H  -6.012997 -2.860127 2.431071
H  -2.37196 -2.950526 1.33624
H  -3.46167 -3.397324 2.64722
H  -3.560805 -4.227029 1.110085
H  5.073982 -1.175633 0.632127
H  3.79344 -2.315632 0.303216
H  3.111827 0.428192 -2.988046
H  4.042191 1.778605 -2.388156
H  5.617949 -2.133398 -1.518158
H  3.96316 -2.020538 -2.081489
H  5.423755 -0.274669 -3.120852
H  5.793969 0.362584 -1.5319
elementType: O N C H
totalener: -1094.87834008 hartree
nucrepener: 2126.31224661 hartree
electener: -3221.19058669 hartree
oneelecener: -5714.39087846 hartree
twoeener: 2493.20029177 hartree
cpcmener: -0.03398371 hartree
kineticenergy: 1090.03387496 hartree
xcener: -105.970405286811 hartree
chargesum: -0.0000000
charge: -0.273235 -0.448849 -0.408591 -0.400440 -0.082184 0.104917 0.081012 -0.127157 -0.269147 -0.272338 -0.298629 0.406319 -0.045800 0.061118 -0.219973 -0.252135 -0.081453 -0.022109 -0.067860 -0.072237 -0.137643 -0.135060 0.324604 0.249595 0.097296 0.091956 0.073517 0.099090 0.100895 0.098202 0.095819 0.087237 0.117557 0.127797 0.137315 0.087426 0.093057 0.092693 0.088045 0.096450 0.094919 0.100082 0.093183 0.101382 0.094863 0.080715 0.078526 0.081048 0.078205
qa: -0.2732 -0.4488 -0.4086 -0.4004 -0.0822 0.1049 0.0810 -0.1272 -0.2691 -0.2723 -0.2986 0.4063 -0.0458 0.0611 -0.2200 -0.2521 -0.0815 -0.0221 -0.0679 -0.0722 -0.1376 -0.1351 0.3246 0.2496 0.0973 0.0920 0.0735 0.0991 0.1009 0.0982 0.0958 0.0872 0.1176 0.1278 0.1373 0.0874 0.0931 0.0927 0.0880 0.0964 0.0949 0.1001 0.0932 0.1014 0.0949 0.0807 0.0785 0.0810 0.0782
va: 2.1042 2.0594 2.1072 2.1073 3.0870 3.7057 3.7078 3.8473 3.9086 3.9089 3.8616 4.1959 3.7661 3.8880 3.9236 3.9428 3.7026 3.5972 3.9190 3.9189 3.9165 3.9144 4.1952 4.2267 1.0256 1.0327 1.0148 1.0022 1.0046 1.0014 1.0020 1.0063 1.0112 1.0094 1.0207 1.0091 0.9965 0.9959 1.0108 0.9966 0.9974 1.0052 1.0160 1.0056 1.0156 1.0094 1.0068 1.0096 1.0066
dispcorr: -0.024519808 hartree
energy: -1094.902859886851
dipole: -12.77681 14.06046 1.28365 -20.88001 18.85494 -2.02507 -10.45431 9.57273 -0.88158
magnitude: 2.55458 au
magnitude: 6.49322 debye
