program: Orca
programVersion: 5.0.2
elementType: O O O O N C C C C C C C C C C C C C C C C C C C H H H H H H H H H H H H H H H H H H H H H H H H H
charge: 0
multiplicity: 1
keywords: wb97x-d3
keywords: def2-TZVPP
keywords: def2/J RIJCOSX
keywords: DEFGRID2
keywords: scfconv7
keywords: smallprint printgap noloewdin
keywords: NOSOSCF
formula: C19H25NO4
InChI: InChI=1/C19H25NO4/c1-11(2)9-14-15(19(14,3)4)18(23)24-10-20-16(21)12-7-5-6-8-13(12)17(20)22/h9,14-15H,5-8,10H2,1-4H3
49 atoms
O  -0.249818 1.099147 0.649868
O  -1.479065 2.063266 -0.955931
O  1.778521 0.150959 -1.691206
O  2.89753 1.586359 2.470237
N  2.045008 1.126488 0.375569
C  -3.795438 0.566204 0.573441
C  -3.45468 -0.156766 -0.691975
C  -2.347903 0.200226 0.270745
C  -4.267756 1.99594 0.488065
C  -4.437429 -0.207065 1.698431
C  -3.798268 -1.585723 -0.909467
C  -1.351438 1.219144 -0.103056
C  -4.917718 -2.012527 -1.499568
C  0.871206 1.931195 0.374838
C  -5.185103 -3.47198 -1.7060
C  -5.985693 -1.090626 -2.002532
C  3.662741 -0.38262 -0.263477
C  3.996045 0.05152 0.952728
C  4.436005 -1.360693 -1.065888
C  5.21725 -0.347322 1.694352
C  5.491513 -2.030373 -0.182948
C  6.193804 -1.029109 0.73372
C  2.401627 0.283734 -0.669671
C  2.9581 1.008054 1.416296
H  -3.489576 0.469293 -1.579715
H  -1.953536 -0.611299 0.87312
H  -3.875759 2.527023 -0.376737
H  -5.35735 2.015939 0.414295
H  -3.992029 2.55778 1.383224
H  -4.2712 0.293889 2.654327
H  -5.516993 -0.277301 1.545587
H  -4.051658 -1.222785 1.785326
H  -3.079537 -2.324499 -0.566228
H  0.955693 2.684105 1.157107
H  0.76726 2.431138 -0.586297
H  -6.102821 -3.77854 -1.196882
H  -5.330853 -3.699434 -2.765569
H  -4.37147 -4.097215 -1.337905
H  -6.958809 -1.365773 -1.587678
H  -5.804626 -0.045516 -1.755883
H  -6.083913 -1.165024 -3.089217
H  3.766776 -2.104255 -1.505939
H  4.904449 -0.843705 -1.909737
H  5.678034 0.525524 2.163215
H  4.943398 -1.019674 2.513852
H  5.013703 -2.803348 0.425713
H  6.223948 -2.538027 -0.812405
H  6.689892 -0.267142 0.125486
H  6.976615 -1.530893 1.304428
elementType: O N C H
totalener: -1094.87900852 hartree
nucrepener: 2041.76840059 hartree
electener: -3136.64740911 hartree
oneelecener: -5545.78422703 hartree
twoeener: 2409.13681792 hartree
cpcmener: -0.03060672 hartree
kineticenergy: 1090.03617946 hartree
xcener: -105.969194320473 hartree
chargesum: 0.0000000
charge: -0.281662 -0.461271 -0.410111 -0.409461 -0.096457 0.123207 -0.016008 -0.124771 -0.294101 -0.269520 -0.243469 0.418377 -0.042590 0.079337 -0.227632 -0.248310 -0.063319 -0.081285 -0.068694 -0.075105 -0.136871 -0.134798 0.314585 0.322759 0.100517 0.094421 0.096066 0.095241 0.101575 0.100370 0.096194 0.091945 0.119428 0.126712 0.137921 0.093903 0.093921 0.089218 0.094512 0.086576 0.102508 0.094375 0.100169 0.092467 0.101070 0.078415 0.081002 0.078023 0.080618
qa: -0.2817 -0.4613 -0.4101 -0.4095 -0.0965 0.1232 -0.0160 -0.1248 -0.2941 -0.2695 -0.2435 0.4184 -0.0426 0.0793 -0.2276 -0.2483 -0.0633 -0.0813 -0.0687 -0.0751 -0.1369 -0.1348 0.3146 0.3228 0.1005 0.0944 0.0961 0.0952 0.1016 0.1004 0.0962 0.0919 0.1194 0.1267 0.1379 0.0939 0.0939 0.0892 0.0945 0.0866 0.1025 0.0944 0.1002 0.0925 0.1011 0.0784 0.0810 0.0780 0.0806
va: 2.1067 2.0506 2.1070 2.1087 3.1009 3.6835 3.8000 3.8555 3.8993 3.9067 3.8549 4.1791 3.7098 3.8507 3.9281 3.9378 3.6694 3.6920 3.9220 3.9214 3.9168 3.9133 4.2214 4.2250 1.0250 1.0353 1.0179 1.0006 0.9999 1.0032 1.0012 1.0026 1.0072 1.0108 1.0178 0.9965 0.9953 1.0076 0.9982 1.0080 0.9985 1.0149 1.0051 1.0159 1.0051 1.0064 1.0095 1.0069 1.0096
dispcorr: -0.022438281 hartree
energy: -1094.901446797256
dipole: -22.72477 23.67966 0.95489 -15.16369 13.67267 -1.49101 -2.50215 3.03201 0.52986
magnitude: 1.84816 au
magnitude: 4.69764 debye
