program: Gaussian 09
title: 000067945
version: EM64L-G09RevD.01
frameworkgroup: C1[X(C8H4F6)]
method: RPBEPBE
basis: SDD
operation: Freq
keyword: #p
keyword: freq=noraman
keyword: PBEPBE/SDD
title: #p freq=noraman PBEPBE/SDD
converged: NO YES NO NO
title: Mulliken charges:
elementType: F F F F F F C C C C C C C C H H H H
charge: -0.160854 -0.160154 -0.160227 -0.160854 -0.160150 -0.160230 0.313588 0.313589 -0.352886 -0.352887 -0.297807 -0.297806 0.270750 0.270750 0.276530 0.276531 0.271058 0.271057
chargesum: 0.00000
title: Mulliken charges with hydrogens summed into heavy atoms:
elementType: F F F F F F C C C C C C C C
charge: -0.160854 -0.160154 -0.160227 -0.160854 -0.160150 -0.160230 0.313588 0.313589 -0.076356 -0.076356 -0.026749 -0.026749 0.270750 0.270750
polarizability: 1.15014583e+02 -4.44166659e-05 8.97662884e+01 -4.41602092e-03 -5.10081384e-05 4.85568515e+01
1716.lowfreq: -22.1388 -13.5986 -3.2741 -3.0925 -0.0012 -0.0005 0.0008 13.8762 61.6327
frequency: -21.4071 -13.4226 61.6313 124.3903 155.8124 209.5055 223.7808 270.8958 342.5084 370.0878 373.9257 399.8429 419.5379 438.8529 502.5405 516.8293 529.7607 589.8568 605.3501 626.8831 660.7998 741.9400 748.9044 837.9727 858.0799 964.5454 981.5246 985.3400 997.4204 998.8378 1005.9167 1017.6673 1035.2040 1042.0188 1142.3743 1201.3308 1271.3414 1290.3031 1313.9692 1388.3790 1407.0252 1507.2009 1593.6521 1630.5191 3157.1290 3168.4516 3175.6136 3186.2871
redmass: 4.9763 18.8973 11.3212 12.6422 12.1794 9.0447 17.1478 9.2427 13.9665 7.3114 8.5852 3.1972 9.1368 9.8434 15.6327 9.4593 9.1879 3.3103 13.9170 7.1392 13.9860 4.2403 8.3527 1.4657 1.3390 1.4091 1.8720 8.7359 10.9633 3.3620 9.0869 7.9027 3.5529 4.4466 1.4298 1.1074 3.0998 10.8930 1.2537 8.6003 3.0931 2.6506 7.5878 6.3332 1.0893 1.0893 1.0980 1.0976
irintensity: 0.3464 0.0000 2.3967 4.8498 0.0000 0.5406 0.0728 0.5605 2.6676 0.0000 0.7798 0.0000 37.8682 0.0025 0.0002 0.0000 0.4278 21.8783 0.0000 0.0282 4.9787 0.0000 0.0038 74.9230 76.8574 0.0002 0.0014 243.3192 430.8570 0.0360 57.0769 294.1423 56.3359 30.0837 20.8377 0.4678 513.7998 0.8056 1.3724 1.9561 34.7633 13.2303 0.0336 0.0018 0.4739 0.0232 0.6286 0.0171
temp: 298.150 k
press: 1.00000 atm
elementType: 9 9 9 9 9 9 6 6 6 6 6 6 6 6 1 1 1 1
symmnumber: 1
zpe: 275570.2 jmol-1
zpe.correction: 0.104959 hartree
zpe.thermalcorrener: 0.115357 hartree
zpe.thermalcorrenthalpy: 0.116301 hartree
zpe.thermalcorrgfe: 0.068231 hartree
zpe.sumelectzpe: -905.298214 hartree
zpe.sumelectthermal: -905.287816 hartree
zpe.sumelectthermalent: -905.286872 hartree
zpe.sumelectthermalfe: -905.334942 hartree
dipole: 0.0000 0.2244 -0.0001
dipole: 0.2244
quadrupole: -99.0282 -69.5081 -81.6929
quadrupole: 0.0000 0.0055 0.0000
quadrupole: -15.6185 13.9016 1.7169 0.0000 0.0055 0.0000
hfenergy: -905.4031731 hartree
pointgroup: C01 [X(C8H4F6)]
dipole: 0.0000031 0.0883007 -0.0000464 debye
dipolederiv: -0.5668965 0.2302222 0.0000441 0.1954011 -0.6818007 0.0002796 0.0001602 0.0001641 -0.2855525 -0.6419381 -0.1079168 -0.1888308 -0.1591551 -0.3771793 -0.2077811 -0.1956365 -0.1788488 -0.6318053 -0.6415144 -0.1072353 0.1890912 -0.1583792 -0.3764844 0.207529 0.1961872 0.1786016 -0.6331926 -0.5668682 -0.2302142 0.0001137 -0.1953929 -0.6818283 -0.0001361 0.0001825 -0.0000439 -0.2855527 -0.6419821 0.1078349 -0.1888712 0.15907 -0.3770478 0.2076993 -0.1957297 0.1787773 -0.6319394 -0.641506 0.107283 0.1890779 0.1584288 -0.376581 -0.207586 0.196117 -0.1786488 -0.6330596 -0.3483852 -0.000234 0.0001191 0.0340845 0.0040091 -0.0000084 -0.0000868 0.0000138 -0.1464128 -0.3483833 0.0002135 0.0001329 -0.0341089 0.0040082 0.0000104 0.0000116 -0.0000122 -0.1464128 -0.0219588 -0.1800538 -0.0000542 0.0173878 -0.0023292 -0.0000285 0.0000406 0.0001273 -0.0934584 -0.0219701 0.1800507 -0.0000486 -0.0173873 -0.0023218 0.0000321 0.000027 -0.0001298 -0.0934581 -0.0249363 0.1854015 -0.0000413 0.0036188 0.0123741 0.0000042 -0.0000091 -0.0001139 -0.0902652 -0.0249232 -0.1854059 -0.0000535 -0.0036226 0.0123635 -0.0000012 -0.000029 0.0001276 -0.0902646 2.1004095 -0.0138277 -0.0004775 0.067028 1.3632174 0.0000045 -0.0007758 0.0000578 1.5594539 2.1004138 0.0138745 -0.000498 -0.066979 1.3632146 -0.0000102 -0.0006892 -0.0000627 1.5594556 0.0839154 0.0479955 0.0000648 0.0471476 0.032425 -0.0000427 0.0000486 -0.0000169 0.1624286 0.0839217 -0.0479909 0.0000631 -0.0471444 0.032419 0.0000375 0.0000444 0.000015 0.1624289 0.0613046 -0.0578355 0.0000837 -0.0552847 0.0257675 0.000048 0.0000673 0.0000272 0.1588037 0.0612972 0.0578381 0.0000848 0.0552876 0.0257742 -0.0000505 0.0000697 -0.0000346 0.1588034 unknown
polarizability: 115.0145191|0.0007709|89.7662885|-0.0651969|0.0006771|48.5569152 unknown
InChI: InChI=1S/C8H4F6/c9-7(10,11)5-1-2-6(4-3-5)8(12,13)14/h1-4H
charge 0 multiplicity 1
18 atoms
F  -3.483344 1.283832 0.002054
F  -3.434917 -0.685746 -1.127209
F  -3.43318 -0.683506 1.134843
F  3.483235 1.284056 -0.002289
F  3.4349 -0.685166 1.127576
F  3.433236 -0.68364 -1.134476
C  -1.402522 0.022098 0.001228
C  1.4025 0.022187 -0.00116
C  -0.705177 1.248609 0.00072
C  0.705077 1.248653 -0.000606
C  -0.703063 -1.209764 0.000651
C  0.703123 -1.209718 -0.000615
C  -2.908461 -0.005677 0.002639
C  2.908438 -0.00549 -0.002504
H  -1.256404 2.192748 0.001168
H  1.256238 2.192828 -0.001024
H  -1.25109 -2.15679 0.001074
H  1.25121 -2.156712 -0.001071
