program: Orca
programVersion: 5.0.2
elementType: O O O O N C C C C C C C C C C C C C C C C C C C H H H H H H H H H H H H H H H H H H H H H H H H H
charge: 0
multiplicity: 1
keywords: wb97x-d3
keywords: def2-TZVPP
keywords: def2/J RIJCOSX
keywords: DEFGRID2
keywords: scfconv7
keywords: smallprint printgap noloewdin
keywords: NOSOSCF
formula: C19H25NO4
InChI: InChI=1/C19H25NO4/c1-11(2)9-14-15(19(14,3)4)18(23)24-10-20-16(21)12-7-5-6-8-13(12)17(20)22/h9,14-15H,5-8,10H2,1-4H3
49 atoms
O  -0.536545 1.714927 1.431993
O  -0.398435 -0.517085 1.412824
O  1.482326 2.634787 -0.646872
O  2.534704 -0.428822 2.543027
N  1.780159 1.298559 1.206758
C  -2.301609 0.251592 -1.089238
C  -2.949618 -0.670518 -0.091154
C  -2.267573 0.582596 0.392913
C  -1.045728 -0.210045 -1.786661
C  -3.162521 1.138118 -1.953448
C  -4.415421 -0.801505 0.034606
C  -0.993473 0.493436 1.131328
C  -5.080137 -1.959662 -0.009774
C  0.745178 1.833408 2.034211
C  -6.569228 -2.006755 0.143644
C  -4.392484 -3.285956 -0.203122
C  2.976744 0.730944 -0.677627
C  3.278745 -0.171162 0.256669
C  3.527889 0.755209 -2.053796
C  4.212872 -1.308279 0.072356
C  4.734841 -0.181011 -2.137018
C  4.481327 -1.506875 -1.420636
C  2.003599 1.692927 -0.105861
C  2.518285 0.151771 1.489733
H  -2.390144 -1.582972 0.090222
H  -2.900439 1.413945 0.687294
H  -0.451264 -0.902525 -1.192241
H  -1.305166 -0.723674 -2.714713
H  -0.410823 0.638866 -2.051481
H  -3.507584 0.592666 -2.834594
H  -4.042161 1.514719 -1.432673
H  -2.5931 2.001799 -2.302713
H  -4.980406 0.114608 0.180216
H  0.782645 1.335845 3.003484
H  0.883508 2.901925 2.181517
H  -7.000939 -1.017116 0.295188
H  -7.041399 -2.449281 -0.737887
H  -6.8581 -2.632987 0.992451
H  -5.115621 -4.089415 -0.344336
H  -3.733356 -3.288026 -1.072856
H  -3.78131 -3.556775 0.661316
H  2.747157 0.446786 -2.757273
H  3.801673 1.774039 -2.338092
H  5.144284 -1.101945 0.609957
H  3.801911 -2.215892 0.520607
H  4.985471 -0.362295 -3.183288
H  5.602581 0.311702 -1.688778
H  5.334793 -2.173351 -1.553272
H  3.620944 -2.00608 -1.875875
elementType: O N C H
totalener: -1094.87729325 hartree
nucrepener: 2141.83219089 hartree
electener: -3236.70948414 hartree
oneelecener: -5746.19094571 hartree
twoeener: 2509.48146157 hartree
cpcmener: -0.03211428 hartree
kineticenergy: 1090.04289398 hartree
xcener: -105.971542633458 hartree
chargesum: 0.0000000
charge: -0.272365 -0.448438 -0.408652 -0.400656 -0.100550 0.128615 0.032632 -0.117815 -0.281946 -0.271318 -0.305378 0.381631 -0.010115 0.086587 -0.221735 -0.283931 -0.089133 -0.031623 -0.065673 -0.074481 -0.137689 -0.135716 0.295392 0.295470 0.092880 0.096499 0.090527 0.103784 0.091180 0.097370 0.088061 0.099224 0.117706 0.133805 0.142134 0.084714 0.095121 0.097759 0.094601 0.103080 0.104123 0.099806 0.093844 0.099522 0.093198 0.080802 0.077542 0.080638 0.078967
qa: -0.2724 -0.4484 -0.4087 -0.4007 -0.1005 0.1286 0.0326 -0.1178 -0.2819 -0.2713 -0.3054 0.3816 -0.0101 0.0866 -0.2217 -0.2839 -0.0891 -0.0316 -0.0657 -0.0745 -0.1377 -0.1357 0.2954 0.2955 0.0929 0.0965 0.0905 0.1038 0.0912 0.0974 0.0881 0.0992 0.1177 0.1338 0.1421 0.0847 0.0951 0.0978 0.0946 0.1031 0.1041 0.0998 0.0938 0.0995 0.0932 0.0808 0.0775 0.0806 0.0790
va: 2.1175 2.0623 2.0996 2.1156 3.0695 3.7015 3.7867 3.8380 3.9011 3.9037 3.8844 4.2350 3.6942 3.8875 3.9214 3.9403 3.6965 3.6184 3.9162 3.9130 3.9183 3.9142 4.1946 4.2184 1.0275 1.0328 1.0148 1.0022 1.0095 1.0018 1.0051 1.0023 1.0090 1.0145 0.9916 1.0102 0.9934 0.9927 1.0048 0.9955 0.9967 1.0062 1.0161 1.0041 1.0161 1.0093 1.0061 1.0095 1.0071
dispcorr: -0.024945845 hartree
energy: -1094.902239094027
dipole: -18.02753 18.43577 0.40823 -14.33401 14.20961 -0.12440 -17.75749 16.33708 -1.42041
magnitude: 1.48314 au
magnitude: 3.76984 debye
