program: Orca
programVersion: 5.0.2
elementType: O O O O N C C C C C C C C C C C C C C C C C C C H H H H H H H H H H H H H H H H H H H H H H H H H
charge: 0
multiplicity: 1
keywords: wb97x-d3
keywords: def2-TZVPP
keywords: def2/J RIJCOSX
keywords: DEFGRID2
keywords: scfconv7
keywords: smallprint printgap noloewdin
keywords: NOSOSCF
formula: C19H25NO4
InChI: InChI=1/C19H25NO4/c1-11(2)9-14-15(19(14,3)4)18(23)24-10-20-16(21)12-7-5-6-8-13(12)17(20)22/h9,14-15H,5-8,10H2,1-4H3
49 atoms
O  -0.28665 1.098534 0.061048
O  -1.57236 0.89327 1.889747
O  2.789425 2.694205 -1.079383
O  1.779428 -0.805448 1.6441
N  1.989756 1.155488 0.447726
C  -2.629415 -1.565835 0.212435
C  -3.643412 -0.461125 0.258858
C  -2.222751 -0.151843 -0.159886
C  -2.164924 -2.170909 1.515468
C  -2.655809 -2.563969 -0.919801
C  -4.73498 -0.327985 -0.722662
C  -1.364646 0.654185 0.731791
C  -5.998633 0.024418 -0.47468
C  0.74018 1.748867 0.788875
C  -6.995335 0.135255 -1.590097
C  -6.550707 0.343464 0.881579
C  3.968361 0.634174 -0.604563
C  3.675295 -0.39031 0.195781
C  5.184014 0.734936 -1.450706
C  4.502662 -1.611221 0.358871
C  6.198484 -0.32468 -1.014792
C  5.536455 -1.680643 -0.766766
C  2.886246 1.650716 -0.496547
C  2.384985 -0.107446 0.879485
H  -3.871216 -0.124335 1.263748
H  -2.045394 0.009838 -1.217576
H  -2.224162 -1.477203 2.350342
H  -2.783901 -3.036666 1.757978
H  -1.130131 -2.510853 1.440819
H  -1.677936 -3.035703 -1.029911
H  -3.384847 -3.351066 -0.719638
H  -2.910586 -2.116127 -1.879312
H  -4.47178 -0.528065 -1.757185
H  0.567431 1.666562 1.860643
H  0.772169 2.79914 0.50175
H  -7.405636 1.146591 -1.650157
H  -6.557772 -0.105117 -2.558343
H  -7.843629 -0.534866 -1.429399
H  -6.934018 1.365983 0.909789
H  -7.394468 -0.309745 1.114727
H  -5.826819 0.241661 1.68594
H  4.906621 0.598953 -2.5010
H  5.609735 1.738717 -1.386194
H  4.994493 -1.586816 1.336783
H  3.868513 -2.500478 0.370275
H  6.980152 -0.420479 -1.769742
H  6.69273 0.008169 -0.097486
H  6.292491 -2.430243 -0.528831
H  5.045211 -2.015432 -1.684903
totalener: -1094.85562645 hartree
nucrepener: 2055.29390250 hartree
electener: -3150.14952896 hartree
oneelecener: -5572.49080145 hartree
twoeener: 2422.34127249 hartree
kineticenergy: 1090.10349972 hartree
xcener: -105.974090025539 hartree
chargesum: 0.0000000
charge: -0.271171 -0.378261 -0.319406 -0.321408 -0.111262 0.077966 0.039128 -0.080244 -0.245802 -0.251566 -0.184942 0.348879 -0.053296 0.068752 -0.202464 -0.236105 -0.102847 -0.070546 -0.074168 -0.073800 -0.135139 -0.134696 0.269454 0.253546 0.088964 0.071808 0.096774 0.083501 0.090815 0.090326 0.092769 0.070651 0.069437 0.139027 0.114122 0.084152 0.075483 0.082993 0.086187 0.083853 0.084164 0.093479 0.093621 0.092361 0.093696 0.079940 0.075767 0.079610 0.075899
qa: -0.2712 -0.3783 -0.3194 -0.3214 -0.1113 0.0780 0.0391 -0.0802 -0.2458 -0.2516 -0.1849 0.3489 -0.0533 0.0688 -0.2025 -0.2361 -0.1028 -0.0705 -0.0742 -0.0738 -0.1351 -0.1347 0.2695 0.2535 0.0890 0.0718 0.0968 0.0835 0.0908 0.0903 0.0928 0.0707 0.0694 0.1390 0.1141 0.0842 0.0755 0.0830 0.0862 0.0839 0.0842 0.0935 0.0936 0.0924 0.0937 0.0799 0.0758 0.0796 0.0759
va: 2.1086 2.1310 2.1952 2.1864 3.0871 3.7598 3.7939 3.8457 3.9134 3.9146 3.9071 4.2258 3.8313 3.8806 3.9340 3.9450 3.6563 3.6100 3.9260 3.9256 3.8967 3.8983 4.2794 4.2774 1.0353 1.0363 1.0221 0.9998 1.0069 1.0042 1.0038 1.0108 1.0219 1.0152 1.0113 0.9982 1.0125 0.9982 0.9991 0.9991 1.0165 1.0086 1.0193 1.0082 1.0195 1.0118 1.0086 1.0117 1.0087
dispcorr: -0.022184311 hartree
energy: -1094.877810761669
dipole: -19.66087 20.66410 1.00323 -15.16859 14.33925 -0.82934 -6.10290 5.33532 -0.76757
magnitude: 1.51111 au
magnitude: 3.84092 debye
