program: Orca
programVersion: 5.0.2
elementType: O O O O N C C C C C C C C C C C C C C C C C C C H H H H H H H H H H H H H H H H H H H H H H H H H
charge: 0
multiplicity: 1
keywords: wb97x-d3
keywords: def2-TZVPP
keywords: def2/J RIJCOSX
keywords: DEFGRID2
keywords: scfconv7
keywords: smallprint printgap noloewdin
keywords: NOSOSCF
formula: C19H25NO4
InChI: InChI=1/C19H25NO4/c1-11(2)9-14-15(19(14,3)4)18(23)24-10-20-16(21)12-7-5-6-8-13(12)17(20)22/h9,14-15H,5-8,10H2,1-4H3
49 atoms
O  -0.249601 1.159813 -0.288022
O  -1.823533 1.556122 -1.824724
O  2.844608 2.55614 0.568569
O  1.652796 -1.175588 -1.744014
N  1.972683 0.899397 -0.784238
C  -3.817348 1.191199 0.554432
C  -3.662294 -0.125602 -0.139973
C  -2.426244 0.643471 0.307138
C  -4.342575 2.359829 -0.244781
C  -4.257977 1.233237 1.999041
C  -3.965389 -1.422121 0.489017
C  -1.51557 1.174211 -0.726353
C  -4.404366 -2.5271 -0.118778
C  0.769595 1.524088 -1.209471
C  -4.653009 -3.782108 0.664771
C  -4.683037 -2.647886 -1.586401
C  3.844446 0.3562 0.439329
C  3.495287 -0.737965 -0.23704
C  5.019506 0.463059 1.339855
C  4.207305 -2.038942 -0.184805
C  5.947636 -0.732203 1.112631
C  5.171129 -2.045074 1.003331
C  2.869376 1.438253 0.136162
C  2.273525 -0.439317 -1.030333
H  -3.828676 -0.070325 -1.209802
H  -1.922258 0.255629 1.185085
H  -4.076571 2.308886 -1.296867
H  -5.431497 2.386818 -0.173901
H  -3.963462 3.304052 0.15083
H  -3.970253 2.182772 2.453384
H  -5.343369 1.144371 2.070496
H  -3.82195 0.440178 2.605044
H  -3.794192 -1.482569 1.559563
H  0.909062 2.605152 -1.208835
H  0.521297 1.192296 -2.216757
H  -5.693901 -4.10349 0.574932
H  -4.040242 -4.605941 0.290203
H  -4.432675 -3.656587 1.724193
H  -4.492145 -1.736432 -2.147313
H  -4.071248 -3.438054 -2.027825
H  -5.724906 -2.929468 -1.757476
H  5.543025 1.406824 1.171869
H  4.676215 0.497057 2.378951
H  3.490258 -2.860335 -0.1181
H  4.747671 -2.194278 -1.124309
H  6.518043 -0.573472 0.192869
H  6.676618 -0.79254 1.922007
H  4.603411 -2.206384 1.924285
H  5.862313 -2.88438 0.914684
totalener: -1094.85597005 hartree
nucrepener: 2047.19196242 hartree
electener: -3142.04793246 hartree
oneelecener: -5556.20154906 hartree
twoeener: 2414.15361660 hartree
kineticenergy: 1090.10027067 hartree
xcener: -105.972624885688 hartree
chargesum: -0.0000000
charge: -0.266691 -0.392992 -0.317800 -0.315197 -0.127315 0.086953 0.034107 -0.078907 -0.253300 -0.254370 -0.181391 0.351045 -0.050832 0.091837 -0.204070 -0.236816 -0.097718 -0.077762 -0.074639 -0.074427 -0.134346 -0.134662 0.266535 0.255335 0.090163 0.068932 0.102219 0.083844 0.083365 0.091336 0.093532 0.072817 0.069872 0.120788 0.125345 0.083821 0.084879 0.074859 0.085169 0.087252 0.084697 0.093757 0.093344 0.094890 0.092173 0.075087 0.080033 0.075363 0.079886
qa: -0.2667 -0.3930 -0.3178 -0.3152 -0.1273 0.0870 0.0341 -0.0789 -0.2533 -0.2544 -0.1814 0.3510 -0.0508 0.0918 -0.2041 -0.2368 -0.0977 -0.0778 -0.0746 -0.0744 -0.1343 -0.1347 0.2665 0.2553 0.0902 0.0689 0.1022 0.0838 0.0834 0.0913 0.0935 0.0728 0.0699 0.1208 0.1253 0.0838 0.0849 0.0749 0.0852 0.0873 0.0847 0.0938 0.0933 0.0949 0.0922 0.0751 0.0800 0.0754 0.0799
va: 2.1137 2.1070 2.1960 2.1967 3.1164 3.7385 3.8036 3.8656 3.9088 3.9191 3.9181 4.2028 3.8336 3.8961 3.9338 3.9440 3.6425 3.6156 3.9276 3.9249 3.8969 3.8985 4.2781 4.2810 1.0296 1.0364 1.0230 1.0001 1.0031 1.0041 1.0032 1.0104 1.0217 1.0033 1.0093 0.9979 0.9983 1.0124 1.0169 0.9993 0.9983 1.0190 1.0085 1.0191 1.0081 1.0088 1.0117 1.0089 1.0118
dispcorr: -0.021490081 hartree
energy: -1094.877460129065
dipole: -19.39735 20.28815 0.89081 -13.96932 13.01389 -0.95543 9.06333 -8.12164 0.94169
magnitude: 1.61033 au
magnitude: 4.09314 debye
