program: Orca
programVersion: 5.0.2
elementType: O O O O N C C C C C C C C C C C C C C C C C C C H H H H H H H H H H H H H H H H H H H H H H H H H
charge: 0
multiplicity: 1
keywords: wb97x-d3
keywords: def2-TZVPP
keywords: def2/J RIJCOSX
keywords: DEFGRID2
keywords: scfconv7
keywords: smallprint printgap noloewdin
keywords: NOSOSCF
formula: C19H25NO4
InChI: InChI=1/C19H25NO4/c1-11(2)9-14-15(19(14,3)4)18(23)24-10-20-16(21)12-7-5-6-8-13(12)17(20)22/h9,14-15H,5-8,10H2,1-4H3
49 atoms
O  -0.532886 1.730175 1.38718
O  -0.273041 -0.491997 1.488633
O  1.486641 2.637487 -0.768247
O  2.667455 -0.149713 2.633874
N  1.805605 1.420088 1.16796
C  -2.303495 -0.204795 -0.930676
C  -2.940257 -0.861092 0.257368
C  -2.212998 0.440195 0.44511
C  -1.084953 -0.842006 -1.552587
C  -3.176997 0.513943 -1.929218
C  -4.413123 -0.915514 0.451039
C  -0.923069 0.465496 1.165525
C  -5.243393 -1.710663 -0.224914
C  0.743679 1.948946 1.961284
C  -6.715477 -1.722891 0.055454
C  -4.789671 -2.654044 -1.296691
C  3.029541 0.7759 -0.670217
C  3.361307 -0.050691 0.320455
C  3.582345 0.725474 -2.046813
C  4.334146 -1.166083 0.210637
C  4.81955 -0.174436 -2.070533
C  4.608251 -1.457674 -1.266253
C  2.020485 1.746044 -0.167483
C  2.598979 0.330595 1.539633
H  -2.392718 -1.719789 0.639393
H  -2.814262 1.335646 0.562283
H  -1.393404 -1.532116 -2.340896
H  -0.443522 -0.08661 -2.012304
H  -0.488164 -1.404465 -0.838052
H  -3.554546 -0.182665 -2.680642
H  -4.039906 0.987035 -1.463116
H  -2.60688 1.28637 -2.447946
H  -4.828178 -0.272258 1.221737
H  0.821633 1.504924 2.954765
H  0.823784 3.031094 2.036495
H  -7.288123 -1.470119 -0.840419
H  -7.047821 -2.716241 0.366986
H  -6.989353 -1.017831 0.839194
H  -5.045385 -3.684423 -1.036909
H  -5.294932 -2.440217 -2.241927
H  -3.716525 -2.611177 -1.471745
H  2.813907 0.345746 -2.728432
H  3.818297 1.731525 -2.400508
H  5.258218 -0.894987 0.731509
H  3.953461 -2.05152 0.72415
H  5.080558 -0.416098 -3.10198
H  5.670417 0.373844 -1.655926
H  5.480204 -2.10673 -1.359566
H  3.762792 -2.011404 -1.684877
totalener: -1094.85150012 hartree
nucrepener: 2139.20990228 hartree
electener: -3234.06140240 hartree
oneelecener: -5740.47272242 hartree
twoeener: 2506.41132002 hartree
kineticenergy: 1090.09832204 hartree
xcener: -105.972661701225 hartree
chargesum: 0.0000000
charge: -0.257343 -0.377240 -0.314697 -0.306811 -0.124723 0.079556 -0.020143 -0.083082 -0.284471 -0.252608 -0.197849 0.328466 -0.018178 0.091218 -0.210366 -0.248135 -0.108362 -0.044529 -0.068549 -0.080570 -0.138351 -0.134456 0.233840 0.259905 0.110131 0.082288 0.085506 0.090846 0.100948 0.082744 0.083216 0.104217 0.089186 0.127618 0.119869 0.083953 0.086253 0.079577 0.098313 0.088905 0.084310 0.088774 0.093827 0.091237 0.096804 0.078779 0.075022 0.078866 0.076287
qa: -0.2573 -0.3772 -0.3147 -0.3068 -0.1247 0.0796 -0.0201 -0.0831 -0.2845 -0.2526 -0.1978 0.3285 -0.0182 0.0912 -0.2104 -0.2481 -0.1084 -0.0445 -0.0685 -0.0806 -0.1384 -0.1345 0.2338 0.2599 0.1101 0.0823 0.0855 0.0908 0.1009 0.0827 0.0832 0.1042 0.0892 0.1276 0.1199 0.0840 0.0863 0.0796 0.0983 0.0889 0.0843 0.0888 0.0938 0.0912 0.0968 0.0788 0.0750 0.0789 0.0763
va: 2.1304 2.1247 2.1970 2.2075 3.0692 3.7388 3.8129 3.8255 3.9025 3.9044 3.8701 4.2711 3.7361 3.9166 3.9382 3.9345 3.6523 3.5972 3.9258 3.9202 3.9027 3.8988 4.2687 4.2580 1.0250 1.0332 1.0057 1.0058 1.0181 1.0009 1.0076 1.0052 1.0134 1.0140 0.9936 0.9989 0.9984 1.0106 1.0043 0.9981 1.0099 1.0092 1.0191 1.0075 1.0191 1.0114 1.0080 1.0114 1.0089
dispcorr: -0.025409149 hartree
energy: -1094.876909270911
dipole: -19.25817 19.38248 0.12431 -15.36210 15.04097 -0.32113 -19.09868 18.02037 -1.07831
magnitude: 1.13195 au
magnitude: 2.87720 debye
