program: Orca
programVersion: 5.0.2
elementType: O O O O N C C C C C C C C C C C C C C C C C C C H H H H H H H H H H H H H H H H H H H H H H H H H
charge: 0
multiplicity: 1
keywords: wb97x-d3
keywords: def2-TZVPP
keywords: def2/J RIJCOSX
keywords: DEFGRID2
keywords: scfconv7
keywords: smallprint printgap noloewdin
keywords: NOSOSCF
formula: C19H25NO4
InChI: InChI=1/C19H25NO4/c1-11(2)9-14-15(19(14,3)4)18(23)24-10-20-16(21)12-7-5-6-8-13(12)17(20)22/h9,14-15H,5-8,10H2,1-4H3
49 atoms
O  0.318402 1.272495 0.03895
O  1.496461 0.924831 -1.839102
O  -2.926159 2.779855 1.085989
O  -1.572735 -0.67569 -1.532748
N  -1.962434 1.27651 -0.37667
C  2.560186 -1.492072 -0.125562
C  3.605549 -0.424081 -0.23763
C  2.210582 -0.051671 0.221986
C  2.032123 -2.124218 -1.389831
C  2.599494 -2.454732 1.035823
C  4.725612 -0.309456 0.718202
C  1.340228 0.745881 -0.654756
C  6.021209 -0.175958 0.415444
C  -0.728012 1.933717 -0.660828
C  7.051917 -0.070641 1.499092
C  6.577209 -0.125615 -0.974631
C  -3.968996 0.656486 0.566816
C  -3.570135 -0.36226 -0.196566
C  -5.239818 0.702705 1.329961
C  -4.312247 -1.631855 -0.3830
C  -6.163462 -0.41473 0.842065
C  -5.414886 -1.734836 0.672144
C  -2.938717 1.72238 0.506953
C  -2.267182 -0.007102 -0.806736
H  3.825366 -0.131286 -1.258567
H  2.082899 0.137228 1.282154
H  2.58705 -3.041855 -1.59398
H  2.130916 -1.487291 -2.265676
H  0.979833 -2.395751 -1.283312
H  2.891827 -1.981526 1.97206
H  3.306354 -3.262091 0.834399
H  1.61766 -2.906283 1.188141
H  4.457062 -0.33935 1.770256
H  -0.546263 1.941956 -1.73293
H  -0.787945 2.960222 -0.306496
H  7.611005 0.865149 1.417378
H  7.787473 -0.875457 1.420488
H  6.610491 -0.113837 2.494546
H  7.271581 -0.954077 -1.136266
H  7.153716 0.790503 -1.124713
H  5.821684 -0.173965 -1.756025
H  -5.026179 0.590666 2.397596
H  -5.714724 1.680018 1.218064
H  -4.735798 -1.657942 -1.391946
H  -3.629868 -2.48272 -0.320502
H  -6.988923 -0.53799 1.54386
H  -6.605328 -0.12326 -0.114687
H  -6.109733 -2.528852 0.396831
H  -4.970939 -2.02344 1.628775
elementType: O N C H
totalener: -1094.86974119 hartree
nucrepener: 2063.34792388 hartree
electener: -3158.21766507 hartree
oneelecener: -5589.13934358 hartree
twoeener: 2430.92167850 hartree
cpcmener: -0.03809192 hartree
kineticenergy: 1090.04294842 hartree
xcener: -105.975333505545 hartree
chargesum: 0.0000000
charge: -0.285625 -0.480879 -0.434791 -0.442189 -0.093793 0.110765 0.037430 -0.098351 -0.281200 -0.268795 -0.285751 0.407721 -0.048749 0.079579 -0.218319 -0.251441 -0.080011 -0.056250 -0.072528 -0.070618 -0.135037 -0.135853 0.345459 0.336390 0.093949 0.093062 0.099636 0.094390 0.093938 0.089488 0.097768 0.098627 0.122135 0.143297 0.125782 0.093475 0.093599 0.088812 0.097515 0.095629 0.089810 0.102356 0.093358 0.101719 0.094038 0.081538 0.078799 0.081136 0.078979
qa: -0.2856 -0.4809 -0.4348 -0.4422 -0.0938 0.1108 0.0374 -0.0984 -0.2812 -0.2688 -0.2858 0.4077 -0.0487 0.0796 -0.2183 -0.2514 -0.0800 -0.0563 -0.0725 -0.0706 -0.1350 -0.1359 0.3455 0.3364 0.0939 0.0931 0.0996 0.0944 0.0939 0.0895 0.0978 0.0986 0.1221 0.1433 0.1258 0.0935 0.0936 0.0888 0.0975 0.0956 0.0898 0.1024 0.0934 0.1017 0.0940 0.0815 0.0788 0.0811 0.0790
va: 2.1082 2.0235 2.0777 2.0651 3.1025 3.6797 3.7786 3.8357 3.8988 3.9093 3.8679 4.1574 3.7574 3.8546 3.9200 3.9408 3.7154 3.6762 3.9181 3.9167 3.9134 3.9156 4.1952 4.1863 1.0318 1.0357 1.0017 1.0164 1.0065 1.0058 1.0018 1.0018 1.0096 1.0153 1.0158 0.9964 0.9963 1.0087 0.9968 0.9969 1.0099 1.0049 1.0155 1.0049 1.0153 1.0093 1.0068 1.0093 1.0067
dispcorr: -0.022520951 hartree
energy: -1094.892262142067
dipole: 19.65142 -20.91385 -1.26243 -16.93737 15.74960 -1.18777 5.43787 -4.22730 1.21057
magnitude: 2.11424 au
magnitude: 5.37396 debye
