program: Orca
programVersion: 5.0.2
elementType: O O O O N C C C C C C C C C C C C C C C C C C C H H H H H H H H H H H H H H H H H H H H H H H H H
charge: 0
multiplicity: 1
keywords: wb97x-d3
keywords: def2-TZVPP
keywords: def2/J RIJCOSX
keywords: DEFGRID2
keywords: scfconv7
keywords: smallprint printgap noloewdin
keywords: NOSOSCF
formula: C19H25NO4
InChI: InChI=1/C19H25NO4/c1-11(2)9-14-15(19(14,3)4)18(23)24-10-20-16(21)12-7-5-6-8-13(12)17(20)22/h9,14-15H,5-8,10H2,1-4H3
49 atoms
O  0.400933 1.834279 -1.072722
O  0.548523 1.293428 1.092172
O  -1.882986 0.330383 -2.525912
O  -2.375697 2.11896 1.62547
N  -1.887912 1.522426 -0.555072
C  3.558731 0.792104 0.403565
C  2.843052 -0.518381 0.335342
C  2.290585 0.664151 -0.429161
C  3.564132 1.551623 1.706678
C  4.832309 0.96237 -0.386417
C  3.376378 -1.677827 -0.424822
C  1.017471 1.274368 -0.021213
C  4.129548 -2.646569 0.102493
C  -0.857751 2.460792 -0.872312
C  4.612527 -3.797041 -0.725978
C  4.557665 -2.667276 1.537004
C  -3.231912 -0.34852 -0.631042
C  -3.379984 0.186238 0.581461
C  -3.910903 -1.576866 -1.109677
C  -4.27596 -0.332923 1.642078
C  -4.524936 -2.313379 0.082249
C  -5.236472 -1.35875 1.03927
C  -2.276332 0.487605 -1.396478
C  -2.511951 1.383893 0.68053
H  2.287501 -0.765482 1.236352
H  2.455254 0.650717 -1.500983
H  2.721138 1.311379 2.349722
H  3.566866 2.630312 1.538588
H  4.472938 1.306381 2.259881
H  5.676482 0.535878 0.160184
H  5.044209 2.020685 -0.548679
H  4.791229 0.478583 -1.361615
H  3.128358 -1.731315 -1.480962
H  -1.07527 2.953214 -1.816529
H  -0.814525 3.215053 -0.087466
H  5.703861 -3.853687 -0.718816
H  4.284315 -3.723553 -1.762541
H  4.252148 -4.747281 -0.324071
H  4.217049 -3.5802 2.031991
H  4.188841 -1.817058 2.108721
H  5.648288 -2.668282 1.608907
H  -4.681998 -1.305301 -1.837656
H  -3.204277 -2.217558 -1.642373
H  -3.673214 -0.783776 2.436472
H  -4.824307 0.488426 2.108837
H  -5.221731 -3.070601 -0.278084
H  -3.735289 -2.843712 0.621251
H  -5.718958 -1.920561 1.839571
H  -6.03032 -0.833713 0.501145
elementType: O N C H
totalener: -1094.86844698 hartree
nucrepener: 2101.02774775 hartree
electener: -3195.89619473 hartree
oneelecener: -5664.84679467 hartree
twoeener: 2468.95059994 hartree
cpcmener: -0.03990474 hartree
kineticenergy: 1090.05692237 hartree
xcener: -105.976614870904 hartree
chargesum: 0.0000000
charge: -0.288148 -0.491084 -0.435430 -0.430588 -0.105262 0.134560 -0.013627 -0.123944 -0.301265 -0.273387 -0.252722 0.439391 -0.043858 0.089094 -0.229662 -0.248807 -0.080999 -0.061074 -0.073784 -0.073223 -0.133585 -0.137040 0.335346 0.335062 0.104278 0.092385 0.093983 0.104288 0.096790 0.097333 0.100620 0.093264 0.123810 0.146340 0.133535 0.094333 0.090261 0.095653 0.101697 0.087618 0.097385 0.101633 0.093982 0.102433 0.094098 0.080112 0.078550 0.081454 0.078204
qa: -0.2881 -0.4911 -0.4354 -0.4306 -0.1053 0.1346 -0.0136 -0.1239 -0.3013 -0.2734 -0.2527 0.4394 -0.0439 0.0891 -0.2297 -0.2488 -0.0810 -0.0611 -0.0738 -0.0732 -0.1336 -0.1370 0.3353 0.3351 0.1043 0.0924 0.0940 0.1043 0.0968 0.0973 0.1006 0.0933 0.1238 0.1463 0.1335 0.0943 0.0903 0.0957 0.1017 0.0876 0.0974 0.1016 0.0940 0.1024 0.0941 0.0801 0.0786 0.0815 0.0782
va: 2.1126 2.0164 2.0749 2.0784 3.0885 3.6643 3.8053 3.8731 3.8971 3.9097 3.8562 4.1387 3.7085 3.8853 3.9271 3.9372 3.7068 3.6627 3.9198 3.9154 3.9145 3.9174 4.1877 4.1877 1.0211 1.0370 1.0191 0.9993 1.0000 1.0007 1.0028 1.0021 1.0058 0.9932 1.0154 0.9962 1.0072 0.9954 0.9988 1.0081 0.9975 1.0044 1.0150 1.0049 1.0157 1.0094 1.0067 1.0091 1.0065
dispcorr: -0.023384293 hartree
energy: -1094.891831269330
dipole: 22.00412 -22.17664 -0.17252 -18.95170 17.66966 -1.28204 6.18380 -6.48069 -0.29689
magnitude: 1.32722 au
magnitude: 3.37354 debye
