program: Orca
programVersion: 5.0.2
elementType: O O O O N C C C C C C C C C C C C C C C C C C C H H H H H H H H H H H H H H H H H H H H H H H H H
charge: 0
multiplicity: 1
keywords: wb97x-d3
keywords: def2-TZVPP
keywords: def2/J RIJCOSX
keywords: DEFGRID2
keywords: scfconv7
keywords: smallprint printgap noloewdin
keywords: NOSOSCF
formula: C19H25NO4
InChI: InChI=1/C19H25NO4/c1-11(2)9-14-15(19(14,3)4)18(23)24-10-20-16(21)12-7-5-6-8-13(12)17(20)22/h9,14-15H,5-8,10H2,1-4H3
49 atoms
O  0.243894 0.481881 -1.416675
O  1.231714 -1.506794 -1.749067
O  -1.645892 -1.588853 0.039492
O  -2.980902 2.182759 -2.110308
N  -2.059135 0.218074 -1.326188
C  2.56995 -0.723919 0.989049
C  3.554094 -0.57866 -0.128957
C  2.205831 0.084033 -0.253016
C  1.949424 -2.074763 1.242353
C  2.781428 0.077737 2.248449
C  4.77071 0.264306 -0.005302
C  1.21221 -0.425904 -1.210036
C  5.968268 -0.192907 0.369093
C  -0.908341 0.114365 -2.164045
C  7.160016 0.710715 0.450058
C  6.226517 -1.621228 0.737627
C  -3.497602 -0.078106 0.44982
C  -3.890586 1.026048 -0.1880
C  -4.148793 -0.646294 1.654692
C  -5.064845 1.853116 0.180032
C  -5.119549 0.380676 2.243317
C  -5.944792 1.076924 1.162328
C  -2.305774 -0.619807 -0.246003
C  -2.966692 1.270019 -1.322746
H  3.669132 -1.474295 -0.733378
H  2.176366 1.157382 -0.099311
H  1.908985 -2.704162 0.356304
H  0.936203 -1.977858 1.637364
H  2.541405 -2.607393 1.989229
H  3.159553 1.079899 2.049471
H  3.50002 -0.424728 2.89958
H  1.845971 0.177574 2.801909
H  4.667609 1.320295 -0.238211
H  -0.822778 -0.893928 -2.561578
H  -1.015633 0.810955 -2.992066
H  6.916689 1.73831 0.180812
H  7.956935 0.366642 -0.21439
H  7.580849 0.714299 1.458701
H  6.988387 -2.058093 0.086567
H  5.338731 -2.24923 0.683395
H  6.619377 -1.687291 1.755356
H  -4.674192 -1.566769 1.381084
H  -3.395314 -0.936981 2.390674
H  -4.721264 2.792907 0.624263
H  -5.628773 2.130703 -0.713647
H  -5.779381 -0.11207 2.958204
H  -4.553392 1.129773 2.804006
H  -6.663832 1.756422 1.621322
H  -6.524838 0.330457 0.612378
elementType: O N C H
totalener: -1094.86860990 hartree
nucrepener: 2072.93091519 hartree
electener: -3167.79952508 hartree
oneelecener: -5608.31547064 hartree
twoeener: 2440.51594556 hartree
cpcmener: -0.03788940 hartree
kineticenergy: 1090.03858369 hartree
xcener: -105.973220778146 hartree
chargesum: 0.0000000
charge: -0.286627 -0.480444 -0.440114 -0.435133 -0.095757 0.141895 -0.012904 -0.115814 -0.304241 -0.273745 -0.259945 0.415568 -0.039312 0.081945 -0.229784 -0.249416 -0.057989 -0.076878 -0.073031 -0.074790 -0.136729 -0.134737 0.335858 0.345948 0.100514 0.096113 0.097170 0.096841 0.100123 0.093846 0.098005 0.100628 0.123768 0.142425 0.125933 0.089786 0.095487 0.094439 0.101512 0.087513 0.097168 0.102539 0.094922 0.103066 0.093934 0.081359 0.079243 0.081326 0.078517
qa: -0.2866 -0.4804 -0.4401 -0.4351 -0.0958 0.1419 -0.0129 -0.1158 -0.3042 -0.2737 -0.2599 0.4156 -0.0393 0.0819 -0.2298 -0.2494 -0.0580 -0.0769 -0.0730 -0.0748 -0.1367 -0.1347 0.3359 0.3459 0.1005 0.0961 0.0972 0.0968 0.1001 0.0938 0.0980 0.1006 0.1238 0.1424 0.1259 0.0898 0.0955 0.0944 0.1015 0.0875 0.0972 0.1025 0.0949 0.1031 0.0939 0.0814 0.0792 0.0813 0.0785
va: 2.1093 2.0242 2.0677 2.0773 3.1046 3.6593 3.8048 3.8671 3.8920 3.9068 3.8593 4.1645 3.7052 3.8575 3.9275 3.9373 3.6792 3.7112 3.9180 3.9171 3.9170 3.9153 4.1857 4.1942 1.0232 1.0353 1.0160 1.0077 1.0023 1.0018 1.0008 1.0028 1.0063 1.0152 1.0159 1.0073 0.9952 0.9963 0.9987 1.0082 0.9976 1.0045 1.0147 1.0047 1.0154 1.0093 1.0062 1.0094 1.0066
dispcorr: -0.023401766 hartree
energy: -1094.892011662487
dipole: 20.77652 -21.77015 -0.99363 -2.40638 3.21541 0.80903 19.85935 -18.03453 1.82482
magnitude: 2.22976 au
magnitude: 5.66759 debye
