program: Orca
programVersion: 5.0.2
elementType: O O O O N C C C C C C C C C C C C C C C C C C C H H H H H H H H H H H H H H H H H H H H H H H H H
charge: 0
multiplicity: 1
keywords: wb97x-d3
keywords: def2-TZVPP
keywords: def2/J RIJCOSX
keywords: DEFGRID2
keywords: scfconv7
keywords: smallprint printgap noloewdin
keywords: NOSOSCF
formula: C19H25NO4
InChI: InChI=1/C19H25NO4/c1-11(2)9-14-15(19(14,3)4)18(23)24-10-20-16(21)12-7-5-6-8-13(12)17(20)22/h9,14-15H,5-8,10H2,1-4H3
49 atoms
O  0.357505 0.633768 0.459057
O  1.861671 1.097258 2.040206
O  -2.54374 2.487229 0.028402
O  -1.860213 -1.87488 1.098137
N  -1.905292 0.410631 0.802067
C  3.780448 1.53305 -0.419657
C  3.99886 0.181018 0.156926
C  2.581517 0.619941 -0.196945
C  4.007246 2.746276 0.447812
C  4.123393 1.775473 -1.869871
C  4.64015 -0.931371 -0.582885
C  1.610992 0.81961 0.887737
C  4.50502 -2.213178 -0.232138
C  -0.67948 0.748969 1.433354
C  5.213053 -3.31005 -0.963125
C  3.645275 -2.624542 0.930144
C  -3.847335 0.498449 -0.43301
C  -3.649516 -0.781963 -0.115769
C  -4.995702 1.015781 -1.2153
C  -4.554773 -1.900405 -0.474323
C  -5.720133 -0.150459 -1.889421
C  -5.897548 -1.337142 -0.943257
C  -2.730532 1.300256 0.12294
C  -2.38944 -0.885475 0.658149
H  4.177774 0.174578 1.2299
H  2.160995 0.195814 -1.101355
H  3.823133 2.562168 1.502728
H  3.376458 3.578595 0.132505
H  5.044907 3.068616 0.352436
H  3.911334 0.914258 -2.502775
H  5.182457 2.016908 -1.978539
H  3.551095 2.619039 -2.25929
H  5.27242 -0.678676 -1.428771
H  -0.739395 1.767407 1.814642
H  -0.505043 0.068722 2.265706
H  5.857568 -3.877104 -0.286433
H  5.829524 -2.930347 -1.777702
H  4.500895 -4.026326 -1.380413
H  2.665537 -2.143112 0.905358
H  4.106007 -2.351607 1.883152
H  3.485224 -3.702357 0.948911
H  -5.671433 1.55719 -0.545968
H  -4.655333 1.744472 -1.954363
H  -4.090341 -2.502759 -1.26123
H  -4.687945 -2.569072 0.378906
H  -6.691307 0.186494 -2.252616
H  -5.1500 -0.46873 -2.766335
H  -6.471359 -2.123992 -1.43343
H  -6.477811 -1.021332 -0.072165
elementType: O N C H
totalener: -1094.86903770 hartree
nucrepener: 2053.60106574 hartree
electener: -3148.47010344 hartree
oneelecener: -5569.35005701 hartree
twoeener: 2420.87995357 hartree
cpcmener: -0.03603832 hartree
kineticenergy: 1090.03965105 hartree
xcener: -105.972070781656 hartree
chargesum: -0.0000000
charge: -0.284872 -0.502504 -0.433535 -0.436018 -0.112572 0.150027 -0.029029 -0.081919 -0.274054 -0.289285 -0.288981 0.411143 -0.000682 0.086427 -0.225447 -0.283744 -0.072302 -0.068601 -0.069879 -0.071745 -0.134700 -0.135533 0.338737 0.343309 0.100665 0.094145 0.091320 0.099851 0.096586 0.091275 0.101178 0.099937 0.127989 0.134251 0.130831 0.099822 0.086788 0.096394 0.097789 0.106096 0.099820 0.102023 0.093573 0.103047 0.093645 0.080193 0.078782 0.081293 0.078464
qa: -0.2849 -0.5025 -0.4335 -0.4360 -0.1126 0.1500 -0.0290 -0.0819 -0.2741 -0.2893 -0.2890 0.4111 -0.0007 0.0864 -0.2254 -0.2837 -0.0723 -0.0686 -0.0699 -0.0717 -0.1347 -0.1355 0.3387 0.3433 0.1007 0.0941 0.0913 0.0999 0.0966 0.0913 0.1012 0.0999 0.1280 0.1343 0.1308 0.0998 0.0868 0.0964 0.0978 0.1061 0.0998 0.1020 0.0936 0.1030 0.0936 0.0802 0.0788 0.0813 0.0785
va: 2.1021 1.9941 2.0776 2.0732 3.1360 3.7356 3.8145 3.8542 3.8823 3.9146 3.8538 4.0782 3.6738 3.8881 3.9233 3.9526 3.6955 3.6935 3.9187 3.9200 3.9177 3.9165 4.1872 4.1793 1.0235 1.0287 1.0188 0.9996 1.0007 1.0013 0.9990 1.0024 1.0021 1.0028 1.0030 0.9930 1.0080 0.9941 0.9988 0.9959 1.0059 1.0042 1.0152 1.0046 1.0151 1.0095 1.0065 1.0095 1.0067
dispcorr: -0.022303939 hartree
energy: -1094.891341640764
dipole: 16.65864 -18.08451 -1.42588 -7.44576 6.64764 -0.79813 -10.89284 9.29773 -1.59511
magnitude: 2.28353 au
magnitude: 5.80427 debye
