program: Orca
programVersion: 5.0.2
elementType: O O O O N C C C C C C C C C C C C C C C C C C C H H H H H H H H H H H H H H H H H H H H H H H H H
charge: 0
multiplicity: 1
keywords: wb97x-d3
keywords: def2-TZVPP
keywords: def2/J RIJCOSX
keywords: DEFGRID2
keywords: scfconv7
keywords: smallprint printgap noloewdin
keywords: NOSOSCF
formula: C19H25NO4
InChI: InChI=1/C19H25NO4/c1-11(2)9-14-15(19(14,3)4)18(23)24-10-20-16(21)12-7-5-6-8-13(12)17(20)22/h9,14-15H,5-8,10H2,1-4H3
49 atoms
O  0.396497 0.847799 -0.086993
O  1.849886 2.255996 0.851143
O  -1.945969 -0.475668 1.941984
O  -2.392249 1.867782 -1.924532
N  -1.889126 0.949198 0.130718
C  3.904434 0.760694 -1.021815
C  4.003219 0.23489 0.365359
C  2.639642 0.307394 -0.301872
C  4.166553 2.224781 -1.271529
C  4.326014 -0.121099 -2.172313
C  4.604535 -1.086414 0.680195
C  1.636193 1.247572 0.214752
C  4.212919 -1.880979 1.679483
C  -0.680256 1.635809 0.420332
C  4.886226 -3.192143 1.94402
C  3.079797 -1.54549 2.600008
C  -3.615824 -0.573813 0.190362
C  -3.744356 0.111754 -0.946883
C  -4.543583 -1.630896 0.65991
C  -4.824276 -0.083547 -1.944076
C  -5.837252 -1.566385 -0.15364
C  -5.564544 -1.388821 -1.646597
C  -2.410573 -0.0853 0.900433
C  -2.632902 1.089463 -1.03621
H  4.149957 1.000005 1.12441
H  2.230304 -0.632223 -0.654436
H  3.968521 2.850849 -0.404633
H  3.566374 2.596658 -2.103931
H  5.216126 2.363076 -1.537854
H  5.403649 -0.052546 -2.333031
H  3.834553 0.195314 -3.093944
H  4.078812 -1.170116 -2.010425
H  5.436144 -1.406776 0.058565
H  -0.699588 2.615663 -0.055162
H  -0.589687 1.766745 1.498084
H  5.678501 -3.399634 1.22529
H  4.167659 -4.014787 1.903799
H  5.322638 -3.213207 2.945755
H  3.383461 -1.662193 3.642903
H  2.242768 -2.231906 2.445372
H  2.705473 -0.531132 2.473304
H  -4.063739 -2.60846 0.549811
H  -4.745605 -1.512081 1.726686
H  -5.509306 0.769087 -1.902976
H  -4.41187 -0.089957 -2.955562
H  -6.419685 -2.472713 0.015019
H  -6.444548 -0.730842 0.205177
H  -6.502425 -1.409345 -2.202529
H  -4.967442 -2.230815 -2.007445
elementType: O N C H
totalener: -1094.86991549 hartree
nucrepener: 2059.87208185 hartree
electener: -3154.74199735 hartree
oneelecener: -5581.86812724 hartree
twoeener: 2427.12612990 hartree
cpcmener: -0.03591629 hartree
kineticenergy: 1090.03935428 hartree
xcener: -105.972233319349 hartree
chargesum: -0.0000000
charge: -0.282114 -0.502741 -0.435857 -0.433580 -0.115451 0.153026 -0.014656 -0.090478 -0.277921 -0.286037 -0.301252 0.408854 -0.008224 0.086961 -0.228855 -0.245736 -0.067662 -0.070476 -0.074101 -0.069676 -0.134718 -0.137233 0.344350 0.338717 0.101298 0.093994 0.090298 0.101287 0.096290 0.099735 0.098696 0.093575 0.124998 0.134940 0.130618 0.090243 0.094619 0.096672 0.100510 0.101920 0.082366 0.102498 0.093912 0.102066 0.094046 0.081159 0.078852 0.081504 0.078767
qa: -0.2821 -0.5027 -0.4359 -0.4336 -0.1155 0.1530 -0.0147 -0.0905 -0.2779 -0.2860 -0.3013 0.4089 -0.0082 0.0870 -0.2289 -0.2457 -0.0677 -0.0705 -0.0741 -0.0697 -0.1347 -0.1372 0.3443 0.3387 0.1013 0.0940 0.0903 0.1013 0.0963 0.0997 0.0987 0.0936 0.1250 0.1349 0.1306 0.0902 0.0946 0.0967 0.1005 0.1019 0.0824 0.1025 0.0939 0.1021 0.0940 0.0812 0.0789 0.0815 0.0788
va: 2.1039 1.9928 2.0743 2.0778 3.1382 3.6990 3.8176 3.8319 3.8902 3.9123 3.8953 4.0916 3.7004 3.8863 3.9305 3.9386 3.6826 3.6959 3.9207 3.9176 3.9142 3.9183 4.1831 4.1886 1.0259 1.0293 1.0180 0.9989 1.0006 0.9996 1.0026 1.0014 1.0027 1.0033 1.0027 1.0059 0.9961 0.9962 0.9999 0.9980 1.0134 1.0047 1.0149 1.0044 1.0152 1.0095 1.0066 1.0091 1.0065
dispcorr: -0.022478409 hartree
energy: -1094.892393902682
dipole: 15.89773 -17.33595 -1.43822 -14.43488 12.65656 -1.77832 -1.54370 0.83357 -0.71014
magnitude: 2.39483 au
magnitude: 6.08716 debye
