program: Orca
programVersion: 5.0.2
elementType: O O O O N C C C C C C C C C C C C C C C C C C C H H H H H H H H H H H H H H H H H H H H H H H H H
charge: 0
multiplicity: 1
keywords: wb97x-d3
keywords: def2-TZVPP
keywords: def2/J RIJCOSX
keywords: DEFGRID2
keywords: scfconv7
keywords: smallprint printgap noloewdin
keywords: NOSOSCF
formula: C19H25NO4
InChI: InChI=1/C19H25NO4/c1-11(2)9-14-15(19(14,3)4)18(23)24-10-20-16(21)12-7-5-6-8-13(12)17(20)22/h9,14-15H,5-8,10H2,1-4H3
49 atoms
O  0.2023 1.364917 0.068824
O  1.491106 1.135782 1.890992
O  -3.087026 2.643846 -0.946631
O  -1.593201 -0.806159 1.601325
N  -2.067395 1.151823 0.48793
C  3.715857 0.909524 -0.343714
C  3.440398 -0.4215 0.282667
C  2.285071 0.39565 -0.241281
C  4.194025 2.041064 0.530484
C  4.297791 0.941406 -1.734383
C  3.793428 -1.698614 -0.388057
C  1.323571 0.985948 0.703945
C  4.926577 -2.373069 -0.176424
C  -0.88824 1.874485 0.828116
C  5.205708 -3.669024 -0.873471
C  6.002441 -1.90434 0.754378
C  -4.017789 0.448828 -0.51406
C  -3.583261 -0.563993 0.237764
C  -5.25836 0.436404 -1.326955
C  -4.274939 -1.865302 0.401229
C  -5.774902 -0.99863 -1.447523
C  -5.70941 -1.745773 -0.115794
C  -3.051549 1.569575 -0.400645
C  -2.309806 -0.158815 0.878596
H  3.527557 -0.425251 1.365614
H  1.849851 0.075922 -1.181967
H  3.850594 3.005261 0.151109
H  5.285502 2.061193 0.53286
H  3.871206 1.950599 1.56539
H  4.11246 1.906724 -2.208782
H  3.882308 0.168738 -2.380213
H  5.378983 0.792975 -1.69376
H  3.073079 -2.101723 -1.094153
H  -1.030491 2.922685 0.574032
H  -0.700943 1.795489 1.896235
H  4.394513 -3.960067 -1.540442
H  5.356562 -4.476966 -0.15286
H  6.124101 -3.60643 -1.462639
H  5.786285 -0.941758 1.215356
H  6.953101 -1.811969 0.223102
H  6.168148 -2.63103 1.554096
H  -6.005975 1.079347 -0.851849
H  -5.072287 0.868752 -2.31259
H  -3.72663 -2.636038 -0.149723
H  -4.26021 -2.174942 1.448563
H  -6.799779 -0.985985 -1.819269
H  -5.177458 -1.533542 -2.190583
H  -6.14273 -2.740605 -0.223193
H  -6.315062 -1.217938 0.626007
elementType: O N C H
totalener: -1094.86877385 hartree
nucrepener: 2047.60716651 hartree
electener: -3142.47594037 hartree
oneelecener: -5557.58313597 hartree
twoeener: 2415.10719561 hartree
cpcmener: -0.03799661 hartree
kineticenergy: 1090.03929552 hartree
xcener: -105.973047278011 hartree
chargesum: -0.0000000
charge: -0.286664 -0.484465 -0.434817 -0.438284 -0.098725 0.130620 -0.009189 -0.135779 -0.295816 -0.270532 -0.256391 0.440515 -0.041135 0.079700 -0.230920 -0.250539 -0.081069 -0.056833 -0.070670 -0.073645 -0.135622 -0.135126 0.342695 0.337969 0.098761 0.097469 0.103647 0.097731 0.093503 0.100534 0.093565 0.097783 0.124529 0.127658 0.140974 0.090151 0.095459 0.094667 0.087788 0.096867 0.101939 0.102271 0.094060 0.102753 0.093353 0.080487 0.078688 0.081083 0.079000
qa: -0.2867 -0.4845 -0.4348 -0.4383 -0.0987 0.1306 -0.0092 -0.1358 -0.2958 -0.2705 -0.2564 0.4405 -0.0411 0.0797 -0.2309 -0.2505 -0.0811 -0.0568 -0.0707 -0.0736 -0.1356 -0.1351 0.3427 0.3380 0.0988 0.0975 0.1036 0.0977 0.0935 0.1005 0.0936 0.0978 0.1245 0.1277 0.1410 0.0902 0.0955 0.0947 0.0878 0.0969 0.1019 0.1023 0.0941 0.1028 0.0934 0.0805 0.0787 0.0811 0.0790
va: 2.1060 2.0238 2.0772 2.0730 3.1098 3.6789 3.7875 3.8623 3.9020 3.9070 3.8591 4.1566 3.7046 3.8485 3.9277 3.9381 3.7140 3.6738 3.9169 3.9203 3.9179 3.9154 4.1984 4.1957 1.0257 1.0356 0.9996 1.0003 1.0165 1.0030 1.0020 1.0009 1.0060 1.0131 1.0174 1.0074 0.9952 0.9960 1.0080 0.9975 0.9983 1.0044 1.0153 1.0046 1.0152 1.0095 1.0065 1.0094 1.0066
dispcorr: -0.022520412 hartree
energy: -1094.891294265031
dipole: 22.84238 -23.81152 -0.96914 -13.72700 12.75329 -0.97372 -7.92996 6.56967 -1.36030
magnitude: 1.93333 au
magnitude: 4.91413 debye
