program: Orca
programVersion: 5.0.2
elementType: O O O O N C C C C C C C C C C C C C C C C C C C H H H H H H H H H H H H H H H H H H H H H H H H H
charge: 0
multiplicity: 1
keywords: wb97x-d3
keywords: def2-TZVPP
keywords: def2/J RIJCOSX
keywords: DEFGRID2
keywords: scfconv7
keywords: smallprint printgap noloewdin
keywords: NOSOSCF
formula: C19H25NO4
InChI: InChI=1/C19H25NO4/c1-11(2)9-14-15(19(14,3)4)18(23)24-10-20-16(21)12-7-5-6-8-13(12)17(20)22/h9,14-15H,5-8,10H2,1-4H3
49 atoms
O  0.402891 1.407202 -0.844643
O  0.789019 -0.688804 -1.533746
O  -2.159787 2.743946 0.543831
O  -2.315232 -0.967894 -2.078258
N  -1.91408 1.01703 -0.960457
C  2.572324 -0.804609 1.036839
C  3.454854 -0.524234 -0.139827
C  2.227968 0.332132 0.085361
C  1.76548 -2.079384 1.04856
C  3.033336 -0.381594 2.409839
C  4.795937 0.093041 0.002318
C  1.091061 0.254334 -0.846019
C  5.959684 -0.550692 -0.124606
C  -0.764152 1.512054 -1.64667
C  7.264607 0.171463 0.022657
C  6.077218 -2.016266 -0.409876
C  -3.622269 0.814767 0.574574
C  -3.654856 -0.278504 -0.188174
C  -4.560462 1.111483 1.684947
C  -4.62163 -1.393574 -0.039606
C  -5.761892 0.16797 1.60131
C  -5.339918 -1.270812 1.30587
C  -2.508169 1.67586 0.110645
C  -2.573762 -0.184735 -1.20263
H  3.353128 -1.242877 -0.947878
H  2.409936 1.323904 0.485198
H  2.321557 -2.852733 1.582583
H  1.552964 -2.46404 0.05383
H  0.815047 -1.943273 1.568924
H  2.184501 -0.299449 3.091616
H  3.547044 0.579364 2.405854
H  3.720714 -1.121593 2.825884
H  4.820402 1.154862 0.230787
H  -0.660005 0.98958 -2.596038
H  -0.883745 2.575035 -1.842462
H  7.860431 -0.255463 0.834074
H  7.128478 1.233393 0.228395
H  7.868935 0.079174 -0.883907
H  6.62316 -2.517791 0.393921
H  6.650355 -2.19133 -1.3242
H  5.11679 -2.518016 -0.515625
H  -4.039135 0.993348 2.640501
H  -4.879844 2.155656 1.644951
H  -5.338354 -1.36258 -0.866715
H  -4.109841 -2.35538 -0.122837
H  -6.324133 0.209183 2.535394
H  -6.437347 0.515598 0.814289
H  -6.212671 -1.925392 1.314377
H  -4.677159 -1.624296 2.1011
elementType: O N C H
totalener: -1094.87991563 hartree
nucrepener: 2074.95688637 hartree
electener: -3169.83680200 hartree
oneelecener: -5612.38221294 hartree
twoeener: 2442.54541094 hartree
cpcmener: -0.03375859 hartree
kineticenergy: 1090.03416395 hartree
xcener: -105.968833633467 hartree
chargesum: 0.0000000
charge: -0.280305 -0.455782 -0.409343 -0.400749 -0.094574 0.155380 -0.004859 -0.138371 -0.297705 -0.263211 -0.262462 0.409704 -0.033305 0.075421 -0.228117 -0.250557 -0.083889 -0.059123 -0.071871 -0.075054 -0.135853 -0.135582 0.319874 0.304318 0.100046 0.090603 0.095341 0.095783 0.099618 0.098303 0.089958 0.095086 0.119747 0.128932 0.139430 0.093716 0.088707 0.094185 0.095786 0.096887 0.088530 0.100581 0.092670 0.100717 0.094297 0.080523 0.077801 0.080782 0.077986
qa: -0.2803 -0.4558 -0.4093 -0.4007 -0.0946 0.1554 -0.0049 -0.1384 -0.2977 -0.2632 -0.2625 0.4097 -0.0333 0.0754 -0.2281 -0.2506 -0.0839 -0.0591 -0.0719 -0.0751 -0.1359 -0.1356 0.3199 0.3043 0.1000 0.0906 0.0953 0.0958 0.0996 0.0983 0.0900 0.0951 0.1197 0.1289 0.1394 0.0937 0.0887 0.0942 0.0958 0.0969 0.0885 0.1006 0.0927 0.1007 0.0943 0.0805 0.0778 0.0808 0.0780
va: 2.1211 2.0553 2.1076 2.1138 3.0815 3.6551 3.7852 3.9005 3.9009 3.9058 3.8700 4.1653 3.7115 3.9009 3.9270 3.9437 3.6845 3.6457 3.9202 3.9206 3.9137 3.9148 4.2222 4.2242 1.0222 1.0380 1.0008 1.0186 0.9993 1.0027 1.0031 1.0032 1.0078 1.0190 0.9995 0.9962 1.0080 0.9956 0.9972 0.9983 1.0085 1.0051 1.0156 1.0050 1.0154 1.0096 1.0067 1.0095 1.0067
dispcorr: -0.022822663 hartree
energy: -1094.902738293428
dipole: 20.87211 -21.50965 -0.63753 -12.09352 11.99994 -0.09358 14.39359 -12.96240 1.43119
magnitude: 1.56955 au
magnitude: 3.98949 debye
