program: Orca
programVersion: 5.0.2
elementType: O O O O N C C C C C C C C C C C C C C C C C C C H H H H H H H H H H H H H H H H H H H H H H H H H
charge: 0
multiplicity: 1
keywords: wb97x-d3
keywords: def2-TZVPP
keywords: def2/J RIJCOSX
keywords: DEFGRID2
keywords: scfconv7
keywords: smallprint printgap noloewdin
keywords: NOSOSCF
formula: C19H25NO4
InChI: InChI=1/C19H25NO4/c1-11(2)9-14-15(19(14,3)4)18(23)24-10-20-16(21)12-7-5-6-8-13(12)17(20)22/h9,14-15H,5-8,10H2,1-4H3
49 atoms
O  0.6160 1.038539 -1.12848
O  1.603617 2.966794 -0.559452
O  -2.45201 -0.412153 -2.337124
O  -1.405987 2.251607 1.190943
N  -1.682881 1.126858 -0.799803
C  2.570305 -0.002299 1.098831
C  2.883957 -0.539989 -0.268833
C  2.726189 0.950976 -0.074275
C  1.207984 -0.277887 1.688396
C  3.661322 0.048034 2.140047
C  4.223198 -1.070782 -0.609296
C  1.609011 1.760672 -0.599277
C  4.501845 -2.311892 -1.019633
C  -0.590089 1.684414 -1.523217
C  5.909002 -2.717794 -1.340147
C  3.4822 -3.394134 -1.203477
C  -3.403048 -0.243673 -0.117397
C  -3.097679 0.537372 0.919965
C  -4.471727 -1.27223 -0.126083
C  -3.783636 0.515539 2.235118
C  -4.928675 -1.546668 1.308113
C  -5.097901 -0.257287 2.110408
C  -2.496914 0.090805 -1.244505
C  -1.976137 1.425603 0.52572
H  2.048657 -1.034501 -0.7520
H  3.6468 1.52493 -0.052442
H  1.258473 -1.168373 2.318653
H  0.441251 -0.461866 0.938087
H  0.876252 0.548231 2.32048
H  3.774702 -0.925551 2.622015
H  3.415943 0.774445 2.917393
H  4.630145 0.325574 1.726271
H  5.05181 -0.375387 -0.506722
H  -0.739249 1.498104 -2.584694
H  -0.541253 2.758019 -1.355457
H  6.61654 -1.899488 -1.204561
H  5.992818 -3.066127 -2.373422
H  6.231833 -3.550032 -0.708696
H  3.78047 -4.294411 -0.66022
H  3.407413 -3.682447 -2.255591
H  2.48562 -3.121218 -0.861653
H  -5.307449 -0.915802 -0.737162
H  -4.117851 -2.187475 -0.606559
H  -3.127307 0.048299 2.976737
H  -3.960722 1.533539 2.590101
H  -5.866741 -2.103397 1.291841
H  -4.193541 -2.18746 1.803589
H  -5.484712 -0.482553 3.105306
H  -5.842809 0.377551 1.621962
elementType: O N C H
totalener: -1094.87799269 hartree
nucrepener: 2113.75232532 hartree
electener: -3208.63031801 hartree
oneelecener: -5689.27515337 hartree
twoeener: 2480.64483536 hartree
cpcmener: -0.03298068 hartree
kineticenergy: 1090.02722679 hartree
xcener: -105.968971622443 hartree
chargesum: -0.0000000
charge: -0.274753 -0.451952 -0.408400 -0.401965 -0.079949 0.128546 0.074956 -0.153328 -0.286852 -0.265845 -0.305641 0.414724 -0.029093 0.065112 -0.224217 -0.256280 -0.090058 -0.014598 -0.070935 -0.073230 -0.136773 -0.134845 0.327607 0.247258 0.097888 0.091285 0.098806 0.080670 0.102699 0.095084 0.098367 0.087406 0.117864 0.125939 0.139541 0.088191 0.092654 0.093473 0.093538 0.098807 0.089069 0.100807 0.093652 0.101447 0.094857 0.080596 0.078265 0.081361 0.078244
qa: -0.2748 -0.4520 -0.4084 -0.4020 -0.0799 0.1285 0.0750 -0.1533 -0.2869 -0.2658 -0.3056 0.4147 -0.0291 0.0651 -0.2242 -0.2563 -0.0901 -0.0146 -0.0709 -0.0732 -0.1368 -0.1348 0.3276 0.2473 0.0979 0.0913 0.0988 0.0807 0.1027 0.0951 0.0984 0.0874 0.1179 0.1259 0.1395 0.0882 0.0927 0.0935 0.0935 0.0988 0.0891 0.1008 0.0937 0.1014 0.0949 0.0806 0.0783 0.0814 0.0782
va: 2.1038 2.0572 2.1099 2.1064 3.0877 3.6861 3.7153 3.8837 3.9123 3.9064 3.8708 4.1821 3.7321 3.8696 3.9255 3.9448 3.7131 3.6024 3.9196 3.9194 3.9167 3.9143 4.2016 4.2273 1.0235 1.0349 1.0026 1.0125 1.0047 1.0030 1.0019 1.0055 1.0097 1.0121 1.0200 1.0086 0.9955 0.9966 0.9981 0.9963 1.0089 1.0049 1.0157 1.0052 1.0157 1.0096 1.0068 1.0096 1.0067
dispcorr: -0.024215896 hartree
energy: -1094.902208582149
dipole: 13.54920 -14.84338 -1.29418 -21.14436 19.07496 -2.06940 10.67175 -9.74678 0.92496
magnitude: 2.61015 au
magnitude: 6.63447 debye
