program: Orca
programVersion: 5.0.2
elementType: O O O O N C C C C C C C C C C C C C C C C C C C H H H H H H H H H H H H H H H H H H H H H H H H H
charge: 0
multiplicity: 1
keywords: wb97x-d3
keywords: def2-TZVPP
keywords: def2/J RIJCOSX
keywords: DEFGRID2
keywords: scfconv7
keywords: smallprint printgap noloewdin
keywords: NOSOSCF
formula: C19H25NO4
InChI: InChI=1/C19H25NO4/c1-11(2)9-14-15(19(14,3)4)18(23)24-10-20-16(21)12-7-5-6-8-13(12)17(20)22/h9,14-15H,5-8,10H2,1-4H3
49 atoms
O  0.378153 0.326922 0.583374
O  1.855926 0.889953 2.155971
O  -2.297365 2.393792 0.235172
O  -2.10331 -2.081398 0.994988
N  -1.895964 0.211691 0.858572
C  3.619484 1.55075 -0.398446
C  4.057716 0.277919 0.237262
C  2.58948 0.471587 -0.087622
C  3.659511 2.82484 0.408026
C  3.887303 1.769556 -1.867771
C  4.843583 -0.754653 -0.487009
C  1.615181 0.596673 1.007785
C  4.700982 -2.071274 -0.315424
C  -0.669687 0.394643 1.548937
C  5.537307 -3.055874 -1.073188
C  3.696139 -2.672449 0.619812
C  -3.777069 0.589877 -0.414266
C  -3.722923 -0.722863 -0.184753
C  -4.839098 1.278695 -1.18677
C  -4.727284 -1.711785 -0.646446
C  -5.662837 0.244665 -1.95638
C  -5.990407 -0.977915 -1.10022
C  -2.605231 1.230314 0.231501
C  -2.50614 -1.013561 0.61331
H  4.279599 0.364397 1.298956
H  2.216444 -0.060555 -0.955581
H  3.553063 2.659861 1.478182
H  2.874114 3.515165 0.093395
H  4.616673 3.326872 0.251672
H  3.801693 0.853032 -2.451726
H  4.891648 2.169887 -2.021975
H  3.179769 2.490416 -2.282185
H  5.596739 -0.399295 -1.185318
H  -0.677479 1.362792 2.048839
H  -0.553203 -0.389889 2.296784
H  6.215623 -2.568658 -1.773807
H  4.908725 -3.749454 -1.63843
H  6.135702 -3.668053 -0.393226
H  3.247674 -1.948347 1.298205
H  4.153629 -3.457667 1.226516
H  2.885498 -3.148804 0.060392
H  -5.473629 1.846902 -0.498823
H  -4.400488 2.013537 -1.866107
H  -4.304672 -2.301054 -1.466709
H  -4.95351 -2.424582 0.150086
H  -6.582794 0.706917 -2.316675
H  -5.104649 -0.072553 -2.841832
H  -6.632014 -1.663342 -1.655625
H  -6.557877 -0.662106 -0.220118
elementType: O N C H
totalener: -1094.88023328 hartree
nucrepener: 2056.50203893 hartree
electener: -3151.38227220 hartree
oneelecener: -5575.05044367 hartree
twoeener: 2423.66817147 hartree
cpcmener: -0.02936587 hartree
kineticenergy: 1090.04440796 hartree
xcener: -105.970069404208 hartree
chargesum: -0.0000000
charge: -0.276748 -0.473189 -0.407820 -0.408025 -0.111405 0.145740 -0.012226 -0.087460 -0.277945 -0.284086 -0.299494 0.383769 -0.005148 0.088649 -0.228150 -0.246856 -0.072431 -0.075479 -0.069677 -0.074168 -0.135590 -0.135047 0.317566 0.322074 0.101557 0.092791 0.092581 0.099734 0.095028 0.092484 0.098941 0.097683 0.120867 0.128272 0.132765 0.089280 0.093491 0.095837 0.082714 0.099970 0.102332 0.100379 0.093622 0.101167 0.093628 0.080687 0.078583 0.080729 0.078024
qa: -0.2767 -0.4732 -0.4078 -0.4080 -0.1114 0.1457 -0.0122 -0.0875 -0.2779 -0.2841 -0.2995 0.3838 -0.0051 0.0886 -0.2282 -0.2469 -0.0724 -0.0755 -0.0697 -0.0742 -0.1356 -0.1350 0.3176 0.3221 0.1016 0.0928 0.0926 0.0997 0.0950 0.0925 0.0989 0.0977 0.1209 0.1283 0.1328 0.0893 0.0935 0.0958 0.0827 0.1000 0.1023 0.1004 0.0936 0.1012 0.0936 0.0807 0.0786 0.0807 0.0780
va: 2.1054 2.0282 2.1100 2.1100 3.1236 3.7154 3.8094 3.8200 3.8926 3.9087 3.8989 4.1321 3.6990 3.8867 3.9328 3.9387 3.6697 3.6747 3.9211 3.9221 3.9153 3.9138 4.2174 4.2152 1.0268 1.0292 1.0174 0.9993 1.0012 1.0019 0.9997 1.0032 1.0041 1.0039 1.0025 1.0063 0.9961 0.9963 1.0141 1.0006 0.9975 1.0049 1.0154 1.0050 1.0153 1.0095 1.0066 1.0097 1.0070
dispcorr: -0.022500531 hartree
energy: -1094.902733808901
dipole: 16.15019 -17.58801 -1.43782 -4.94108 4.38557 -0.55551 -12.57380 10.92774 -1.64605
magnitude: 2.25509 au
magnitude: 5.73197 debye
