program: Orca
programVersion: 5.0.2
elementType: O O O O N C C C C C C C C C C C C C C C C C C C H H H H H H H H H H H H H H H H H H H H H H H H H
charge: 0
multiplicity: 1
keywords: wb97x-d3
keywords: def2-TZVPP
keywords: def2/J RIJCOSX
keywords: DEFGRID2
keywords: scfconv7
keywords: smallprint printgap noloewdin
keywords: NOSOSCF
formula: C19H25NO4
InChI: InChI=1/C19H25NO4/c1-11(2)9-14-15(19(14,3)4)18(23)24-10-20-16(21)12-7-5-6-8-13(12)17(20)22/h9,14-15H,5-8,10H2,1-4H3
49 atoms
O  0.217786 0.637252 -0.056367
O  1.782157 2.054403 0.661554
O  -2.3572 -0.155012 2.082517
O  -2.37317 1.641384 -2.090818
N  -2.050064 0.960257 0.088454
C  3.659351 0.240629 -1.100172
C  3.80002 -0.146842 0.340284
C  2.416167 -0.059478 -0.279754
C  4.004504 1.65523 -1.494085
C  3.987901 -0.766348 -2.176254
C  4.322135 -1.45802 0.771043
C  1.486521 0.995087 0.160057
C  5.265806 -1.63173 1.701145
C  -0.791342 1.562285 0.346748
C  5.740355 -3.001154 2.079315
C  5.914068 -0.484154 2.430535
C  -3.960206 -0.312236 0.27428
C  -3.960452 0.207437 -0.953868
C  -5.028817 -1.171463 0.838956
C  -5.017154 -0.0069 -1.972157
C  -6.272444 -1.087311 -0.048595
C  -5.924826 -1.158747 -1.535317
C  -2.727337 0.126924 0.972851
C  -2.733942 1.026619 -1.121119
H  4.041619 0.684411 0.995351
H  1.937622 -1.004559 -0.512833
H  5.058039 1.706271 -1.775254
H  3.849238 2.374604 -0.693986
H  3.420329 1.97916 -2.357671
H  3.667884 -1.777072 -1.926285
H  5.064107 -0.794661 -2.358656
H  3.501112 -0.493297 -3.114602
H  3.901689 -2.336251 0.290183
H  -0.710994 2.491125 -0.217348
H  -0.709275 1.784614 1.410492
H  5.588452 -3.189411 3.14578
H  6.81367 -3.107638 1.899202
H  5.226694 -3.785473 1.522879
H  5.196196 0.073034 3.036671
H  6.377089 0.230479 1.747609
H  6.694921 -0.835456 3.105159
H  -4.667354 -2.202418 0.90798
H  -5.259168 -0.865624 1.862328
H  -5.591976 0.916733 -2.094643
H  -4.568728 -0.211641 -2.947305
H  -6.96115 -1.891987 0.211981
H  -6.796598 -0.149443 0.15586
H  -6.838047 -1.147741 -2.131524
H  -5.426605 -2.109179 -1.745154
elementType: O N C H
totalener: -1094.88049661 hartree
nucrepener: 2025.67810865 hartree
electener: -3120.55860527 hartree
oneelecener: -5513.43161835 hartree
twoeener: 2392.87301309 hartree
cpcmener: -0.03022373 hartree
kineticenergy: 1090.03425631 hartree
xcener: -105.968496614935 hartree
chargesum: -0.0000000
charge: -0.276238 -0.472140 -0.407420 -0.407287 -0.113356 0.106908 0.052459 -0.104506 -0.276877 -0.267860 -0.297703 0.401421 -0.009884 0.089450 -0.221399 -0.284903 -0.073780 -0.072072 -0.072919 -0.070808 -0.136279 -0.136557 0.321948 0.317505 0.091560 0.087715 0.094840 0.092512 0.097902 0.087555 0.097247 0.098031 0.115710 0.132356 0.128966 0.097337 0.096430 0.084053 0.103380 0.104754 0.093958 0.101523 0.093161 0.100674 0.094183 0.080760 0.078551 0.081019 0.078120
qa: -0.2762 -0.4721 -0.4074 -0.4073 -0.1134 0.1069 0.0525 -0.1045 -0.2769 -0.2679 -0.2977 0.4014 -0.0099 0.0895 -0.2214 -0.2849 -0.0738 -0.0721 -0.0729 -0.0708 -0.1363 -0.1366 0.3219 0.3175 0.0916 0.0877 0.0948 0.0925 0.0979 0.0876 0.0972 0.0980 0.1157 0.1324 0.1290 0.0973 0.0964 0.0841 0.1034 0.1048 0.0940 0.1015 0.0932 0.1007 0.0942 0.0808 0.0786 0.0810 0.0781
va: 2.1138 2.0322 2.1114 2.1111 3.1252 3.6998 3.7565 3.8965 3.9039 3.9135 3.8978 4.1393 3.6955 3.8863 3.9202 3.9402 3.6689 3.6725 3.9219 3.9199 3.9140 3.9166 4.2159 4.2175 1.0281 1.0348 1.0002 1.0198 0.9998 1.0059 1.0019 1.0023 1.0105 1.0020 1.0030 0.9927 0.9929 1.0104 0.9967 0.9953 1.0049 1.0050 1.0153 1.0047 1.0153 1.0097 1.0064 1.0094 1.0067
dispcorr: -0.021523537 hartree
energy: -1094.902020150555
dipole: 21.29009 -22.57020 -1.28011 -12.80805 11.40470 -1.40335 -1.47587 0.86766 -0.60821
magnitude: 1.99449 au
magnitude: 5.06960 debye
