program: Orca
programVersion: 5.0.2
elementType: O O O O N C C C C C C C C C C C C C C C C C C C H H H H H H H H H H H H H H H H H H H H H H H H H
charge: 0
multiplicity: 1
keywords: wb97x-d3
keywords: def2-TZVPP
keywords: def2/J RIJCOSX
keywords: DEFGRID2
keywords: scfconv7
keywords: smallprint printgap noloewdin
keywords: NOSOSCF
formula: C19H25NO4
InChI: InChI=1/C19H25NO4/c1-11(2)9-14-15(19(14,3)4)18(23)24-10-20-16(21)12-7-5-6-8-13(12)17(20)22/h9,14-15H,5-8,10H2,1-4H3
49 atoms
O  0.52186 1.769189 -1.395396
O  0.365537 -0.459598 -1.513635
O  -1.487884 2.606453 0.732554
O  -2.571507 -0.282011 -2.607268
N  -1.798705 1.367977 -1.185776
C  2.29586 0.151618 1.016492
C  2.925915 -0.719385 -0.036586
C  2.253733 0.560435 -0.447199
C  1.040702 -0.328524 1.701498
C  3.185655 0.974751 1.91286
C  4.396661 -0.846333 -0.177484
C  0.971798 0.527455 -1.177388
C  5.115398 -1.919195 0.16519
C  -0.760123 1.936392 -1.985804
C  6.598204 -1.960317 -0.046461
C  4.526757 -3.156718 0.770557
C  -2.985202 0.704781 0.674218
C  -3.295854 -0.14575 -0.304651
C  -3.526786 0.655444 2.053619
C  -4.232093 -1.288722 -0.175401
C  -4.735786 -0.281073 2.094827
C  -4.491259 -1.566818 1.306566
C  -2.013221 1.693716 0.147252
C  -2.543664 0.240746 -1.524358
H  2.35839 -1.616919 -0.263674
H  2.893209 1.400325 -0.700875
H  0.42096 0.513369 2.019812
H  1.301419 -0.896084 2.597484
H  0.430177 -0.978564 1.076021
H  3.529351 0.378276 2.761141
H  2.642514 1.833903 2.311883
H  4.068818 1.352293 1.397867
H  4.920656 0.006369 -0.600396
H  -0.806147 1.494874 -2.981451
H  -0.8861 3.013083 -2.072057
H  7.127693 -2.087457 0.901839
H  6.973244 -1.053901 -0.522066
H  6.882931 -2.810345 -0.672816
H  4.596046 -4.000826 0.078861
H  3.482028 -3.044503 1.054912
H  5.082457 -3.447425 1.665527
H  -2.741836 0.306226 2.732889
H  -3.795145 1.657591 2.396175
H  -5.166261 -1.051103 -0.694772
H  -3.827248 -2.172166 -0.67463
H  -4.979137 -0.51793 3.131787
H  -5.605617 0.236847 1.680298
H  -5.346277 -2.236783 1.408521
H  -3.630068 -2.092937 1.728708
elementType: O N C H
totalener: -1094.87798321 hartree
nucrepener: 2141.34202187 hartree
electener: -3236.22000508 hartree
oneelecener: -5745.18737247 hartree
twoeener: 2508.96736739 hartree
cpcmener: -0.03213997 hartree
kineticenergy: 1090.04134019 hartree
xcener: -105.970966956540 hartree
chargesum: -0.0000000
charge: -0.272881 -0.447381 -0.408508 -0.400596 -0.101480 0.163346 -0.008131 -0.133114 -0.295251 -0.267774 -0.276632 0.386999 -0.026340 0.086857 -0.226810 -0.255962 -0.090117 -0.029837 -0.066269 -0.076016 -0.138184 -0.135439 0.297208 0.293651 0.097563 0.097857 0.093511 0.102827 0.091484 0.096045 0.099335 0.090441 0.118961 0.133776 0.141889 0.093583 0.088562 0.093424 0.100781 0.088943 0.093504 0.100227 0.094090 0.100109 0.093449 0.080698 0.078049 0.080668 0.078884
qa: -0.2729 -0.4474 -0.4085 -0.4006 -0.1015 0.1633 -0.0081 -0.1331 -0.2953 -0.2678 -0.2766 0.3870 -0.0263 0.0869 -0.2268 -0.2560 -0.0901 -0.0298 -0.0663 -0.0760 -0.1382 -0.1354 0.2972 0.2937 0.0976 0.0979 0.0935 0.1028 0.0915 0.0960 0.0993 0.0904 0.1190 0.1338 0.1419 0.0936 0.0886 0.0934 0.1008 0.0889 0.0935 0.1002 0.0941 0.1001 0.0934 0.0807 0.0780 0.0807 0.0789
va: 2.1166 2.0655 2.0998 2.1154 3.0699 3.6801 3.7960 3.8587 3.8986 3.8985 3.8738 4.2338 3.7038 3.8884 3.9275 3.9438 3.6979 3.6160 3.9159 3.9135 3.9185 3.9140 4.1939 4.2200 1.0252 1.0339 1.0089 1.0028 1.0138 1.0028 1.0030 1.0024 1.0082 1.0144 0.9919 0.9966 1.0083 0.9949 0.9967 1.0069 0.9983 1.0061 1.0160 1.0040 1.0161 1.0094 1.0061 1.0095 1.0072
dispcorr: -0.025176996 hartree
energy: -1094.903160201520
dipole: 18.57243 -18.90906 -0.33663 -15.06577 14.85562 -0.21015 18.57177 -17.07171 1.50006
magnitude: 1.55167 au
magnitude: 3.94403 debye
