program: Orca
programVersion: 5.0.2
elementType: O O O O N C C C C C C C C C C C C C C C C C C C H H H H H H H H H H H H H H H H H H H H H H H H H
charge: 0
multiplicity: 1
keywords: wb97x-d3
keywords: def2-TZVPP
keywords: def2/J RIJCOSX
keywords: DEFGRID2
keywords: scfconv7
keywords: smallprint printgap noloewdin
keywords: NOSOSCF
formula: C19H25NO4
InChI: InChI=1/C19H25NO4/c1-11(2)9-14-15(19(14,3)4)18(23)24-10-20-16(21)12-7-5-6-8-13(12)17(20)22/h9,14-15H,5-8,10H2,1-4H3
49 atoms
O  0.430272 1.323088 -0.584662
O  1.523876 2.484991 0.991285
O  -1.540988 0.169331 1.806025
O  -2.633352 1.30171 -2.463789
N  -1.846193 1.051843 -0.305107
C  4.063405 1.171709 -0.265929
C  3.636581 0.365982 0.913167
C  2.621842 0.700956 -0.162748
C  4.420061 2.625345 -0.073502
C  4.876369 0.500665 -1.348092
C  4.083843 -1.036884 1.110011
C  1.508322 1.61106 0.166732
C  3.312175 -2.059856 1.480544
C  -0.783675 1.999375 -0.303283
C  3.882425 -3.435951 1.653717
C  1.843831 -1.942991 1.755223
C  -3.216864 -0.698586 0.289799
C  -3.53891 -0.362705 -0.958828
C  -3.876506 -1.764757 1.083927
C  -4.602788 -1.00719 -1.768316
C  -5.190016 -2.16474 0.408996
C  -5.028542 -2.31823 -1.103865
C  -2.1081 0.180002 0.749056
C  -2.656576 0.752697 -1.397952
H  3.506075 0.944875 1.824875
H  2.355153 -0.108239 -0.832504
H  3.870473 3.093221 0.738652
H  4.230043 3.198603 -0.98278
H  5.485048 2.710822 0.150962
H  4.604233 -0.545611 -1.486429
H  5.940748 0.537046 -1.107115
H  4.737968 1.010849 -2.302506
H  5.14336 -1.224223 0.957279
H  -0.975761 2.734041 -1.084567
H  -0.734952 2.498353 0.663238
H  4.945616 -3.473352 1.420428
H  3.371427 -4.155254 1.009009
H  3.750075 -3.789691 2.678885
H  1.472169 -0.922507 1.717529
H  1.610171 -2.338798 2.746197
H  1.267068 -2.538572 1.042493
H  -3.203661 -2.624811 1.163775
H  -4.045204 -1.426336 2.10857
H  -5.453414 -0.323318 -1.855746
H  -4.254231 -1.176132 -2.789543
H  -5.561061 -3.094057 0.843463
H  -5.946515 -1.402339 0.616523
H  -5.960928 -2.670609 -1.547171
H  -4.277537 -3.08607 -1.310853
totalener: -1094.85465573 hartree
nucrepener: 2095.74793161 hartree
electener: -3190.60258735 hartree
oneelecener: -5653.37985921 hartree
twoeener: 2462.77727186 hartree
kineticenergy: 1090.09631488 hartree
xcener: -105.971749197395 hartree
chargesum: -0.0000000
charge: -0.268771 -0.384012 -0.322942 -0.318745 -0.111417 0.126044 -0.010523 -0.133454 -0.260846 -0.266545 -0.243860 0.350920 -0.002032 0.071852 -0.213412 -0.223419 -0.071685 -0.101330 -0.076510 -0.073123 -0.133751 -0.135846 0.257044 0.266507 0.107014 0.091477 0.103676 0.084359 0.081671 0.085119 0.088619 0.092278 0.092146 0.113954 0.138232 0.078246 0.082927 0.088282 0.097259 0.089971 0.079572 0.092499 0.094702 0.092547 0.095238 0.079578 0.075377 0.079756 0.075355
qa: -0.2688 -0.3840 -0.3229 -0.3187 -0.1114 0.1260 -0.0105 -0.1335 -0.2608 -0.2665 -0.2439 0.3509 -0.0020 0.0719 -0.2134 -0.2234 -0.0717 -0.1013 -0.0765 -0.0731 -0.1338 -0.1358 0.2570 0.2665 0.1070 0.0915 0.1037 0.0844 0.0817 0.0851 0.0886 0.0923 0.0921 0.1140 0.1382 0.0782 0.0829 0.0883 0.0973 0.0900 0.0796 0.0925 0.0947 0.0925 0.0952 0.0796 0.0754 0.0798 0.0754
va: 2.1019 2.1176 2.1811 2.1950 3.0980 3.7321 3.8118 3.8502 3.9064 3.9077 3.8973 4.1678 3.7362 3.8815 3.9412 3.9408 3.6174 3.6549 3.9274 3.9242 3.8982 3.9003 4.2605 4.2812 1.0246 1.0294 1.0217 1.0019 1.0018 1.0058 1.0022 1.0061 1.0106 1.0085 1.0144 1.0100 0.9993 0.9988 1.0142 1.0033 1.0011 1.0082 1.0189 1.0081 1.0191 1.0119 1.0088 1.0117 1.0086
dispcorr: -0.023451710 hartree
energy: -1094.878107442105
dipole: 15.30451 -16.17928 -0.87476 -16.83643 15.41478 -1.42165 2.48158 -2.76949 -0.28791
magnitude: 1.69387 au
magnitude: 4.30547 debye
