program: Orca
programVersion: 5.0.2
elementType: O O O O N C C C C C C C C C C C C C C C C C C C H H H H H H H H H H H H H H H H H H H H H H H H H
charge: 0
multiplicity: 1
keywords: wb97x-d3
keywords: def2-TZVPP
keywords: def2/J RIJCOSX
keywords: DEFGRID2
keywords: scfconv7
keywords: smallprint printgap noloewdin
keywords: NOSOSCF
formula: C19H25NO4
InChI: InChI=1/C19H25NO4/c1-11(2)9-14-15(19(14,3)4)18(23)24-10-20-16(21)12-7-5-6-8-13(12)17(20)22/h9,14-15H,5-8,10H2,1-4H3
49 atoms
O  0.607327 0.960212 -0.699383
O  1.906539 2.247952 -1.975081
O  -1.98051 2.171351 1.063966
O  -1.904974 -0.926267 -2.269009
N  -1.677548 0.843426 -0.80052
C  3.114992 1.124698 1.183459
C  2.827827 -0.244798 0.661877
C  2.934146 0.91099 -0.309761
C  2.057684 1.839178 1.990329
C  4.519078 1.464484 1.623489
C  3.850397 -1.323027 0.648579
C  1.793959 1.452594 -1.080709
C  3.912654 -2.303388 -0.253699
C  -0.538697 1.48188 -1.358928
C  4.964273 -3.368043 -0.177655
C  2.953496 -2.429713 -1.397628
C  -3.331994 0.20248 0.666093
C  -3.307804 -0.70491 -0.309799
C  -4.271937 0.194251 1.815044
C  -4.205209 -1.883167 -0.402814
C  -5.414463 -0.783994 1.533593
C  -4.906098 -2.098291 0.940167
C  -2.275694 1.216065 0.401626
C  -2.236057 -0.342291 -1.275733
H  1.811989 -0.585453 0.841281
H  3.853228 0.97032 -0.881837
H  2.18079 1.601701 3.04882
H  1.041995 1.566857 1.712541
H  2.151636 2.921528 1.884693
H  4.67983 1.167125 2.662037
H  4.689702 2.540155 1.558394
H  5.27879 0.972878 1.016088
H  4.579274 -1.317919 1.453971
H  -0.499909 1.272503 -2.427688
H  -0.611133 2.558903 -1.206551
H  4.514531 -4.359091 -0.078365
H  5.63834 -3.219292 0.665065
H  5.565912 -3.390315 -1.089865
H  3.482739 -2.396043 -2.353232
H  2.195086 -1.649946 -1.408471
H  2.439201 -3.393363 -1.364054
H  -3.730623 -0.091563 2.722863
H  -4.651519 1.200935 2.003283
H  -4.93687 -1.717462 -1.200273
H  -3.639725 -2.768906 -0.700599
H  -5.970229 -0.9763 2.452366
H  -6.118993 -0.322267 0.835849
H  -5.732658 -2.799522 0.817373
H  -4.206296 -2.563871 1.640366
totalener: -1094.85316131 hartree
nucrepener: 2105.79309116 hartree
electener: -3200.64625247 hartree
oneelecener: -5673.18339105 hartree
twoeener: 2472.53713857 hartree
kineticenergy: 1090.09179922 hartree
xcener: -105.969406460021 hartree
chargesum: -0.0000000
charge: -0.269044 -0.357457 -0.319345 -0.318312 -0.118536 0.126663 0.008110 -0.098769 -0.243300 -0.283798 -0.257825 0.320936 -0.001997 0.070487 -0.211911 -0.221156 -0.080013 -0.088572 -0.076735 -0.072986 -0.134128 -0.136214 0.251844 0.261490 0.095634 0.087287 0.082194 0.083733 0.093274 0.089527 0.094545 0.084355 0.093496 0.126770 0.127917 0.085591 0.077880 0.085647 0.087526 0.078031 0.087452 0.093576 0.095123 0.092771 0.095177 0.080542 0.075955 0.080530 0.076034
qa: -0.2690 -0.3575 -0.3193 -0.3183 -0.1185 0.1267 0.0081 -0.0988 -0.2433 -0.2838 -0.2578 0.3209 -0.0020 0.0705 -0.2119 -0.2212 -0.0800 -0.0886 -0.0767 -0.0730 -0.1341 -0.1362 0.2518 0.2615 0.0956 0.0873 0.0822 0.0837 0.0933 0.0895 0.0945 0.0844 0.0935 0.1268 0.1279 0.0856 0.0779 0.0856 0.0875 0.0780 0.0875 0.0936 0.0951 0.0928 0.0952 0.0805 0.0760 0.0805 0.0760
va: 2.0668 2.1468 2.1890 2.1928 3.1142 3.7350 3.7905 3.8376 3.9054 3.9174 3.9075 4.2102 3.7262 3.9123 3.9429 3.9416 3.6263 3.6388 3.9278 3.9249 3.8973 3.8993 4.2686 4.2651 1.0226 1.0299 1.0034 1.0165 1.0036 1.0002 1.0059 1.0048 1.0092 1.0072 1.0016 0.9985 1.0099 0.9991 1.0016 1.0241 1.0018 1.0084 1.0185 1.0082 1.0192 1.0119 1.0088 1.0117 1.0087
dispcorr: -0.023712712 hartree
energy: -1094.876874025410
dipole: 13.25245 -14.34549 -1.09304 -13.86260 12.68321 -1.17939 11.88738 -10.76952 1.11786
magnitude: 1.95840 au
magnitude: 4.97785 debye
