program: Orca
programVersion: 5.0.2
elementType: O O O O N C C C C C C C C C C C C C C C C C C C H H H H H H H H H H H H H H H H H H H H H H H H H
charge: 0
multiplicity: 1
keywords: wb97x-d3
keywords: def2-TZVPP
keywords: def2/J RIJCOSX
keywords: DEFGRID2
keywords: scfconv7
keywords: smallprint printgap noloewdin
keywords: NOSOSCF
formula: C19H25NO4
InChI: InChI=1/C19H25NO4/c1-11(2)9-14-15(19(14,3)4)18(23)24-10-20-16(21)12-7-5-6-8-13(12)17(20)22/h9,14-15H,5-8,10H2,1-4H3
49 atoms
O  0.342895 0.602543 0.524257
O  1.871415 1.051477 2.086366
O  -2.537789 2.516684 0.121432
O  -1.9103 -1.855447 1.212951
N  -1.914133 0.430021 0.890559
C  3.698991 1.506717 -0.445036
C  4.002118 0.196013 0.194113
C  2.56407 0.538998 -0.148546
C  3.864638 2.76726 0.368255
C  4.012567 1.699869 -1.909583
C  4.70112 -0.904125 -0.516782
C  1.602556 0.766425 0.947623
C  4.587194 -2.198304 -0.21436
C  -0.675994 0.752555 1.505291
C  5.359119 -3.245659 -0.957879
C  3.697986 -2.710745 0.87664
C  -3.824674 0.531069 -0.387481
C  -3.640847 -0.75026 -0.069886
C  -4.949507 1.0548 -1.201766
C  -4.539213 -1.8646 -0.462749
C  -5.649837 -0.106252 -1.910349
C  -5.86446 -1.297194 -0.975779
C  -2.719013 1.334275 0.200664
C  -2.403078 -0.86721 0.746599
H  4.209512 0.260545 1.25936
H  2.14509 0.043152 -1.016499
H  3.197923 3.553884 0.009996
H  4.888256 3.133509 0.270678
H  3.667242 2.616181 1.426518
H  3.392165 2.492156 -2.331348
H  3.840712 0.799074 -2.498551
H  5.056371 1.991346 -2.044813
H  5.374603 -0.621104 -1.320507
H  -0.712728 1.779351 1.869338
H  -0.50344 0.079657 2.345154
H  4.688856 -3.978248 -1.414515
H  6.014272 -3.80264 -0.283382
H  5.976752 -2.817697 -1.746623
H  3.167903 -1.921033 1.404936
H  4.277193 -3.274333 1.612932
H  2.951705 -3.402098 0.476382
H  -5.648372 1.590829 -0.551325
H  -4.58736 1.79481 -1.918903
H  -4.049874 -2.467023 -1.235071
H  -4.698599 -2.539982 0.380714
H  -6.605042 0.230601 -2.315636
H  -5.044639 -0.422432 -2.765073
H  -6.428115 -2.079095 -1.486669
H  -6.474104 -0.98181 -0.124056
totalener: -1094.85628566 hartree
nucrepener: 2054.04588636 hartree
electener: -3148.90217202 hartree
oneelecener: -5569.91189739 hartree
twoeener: 2421.00972538 hartree
kineticenergy: 1090.09486606 hartree
xcener: -105.970524653401 hartree
chargesum: 0.0000000
charge: -0.261339 -0.391085 -0.316843 -0.317180 -0.127415 0.132801 -0.040254 -0.073075 -0.256293 -0.278067 -0.228343 0.322091 -0.001771 0.093434 -0.211635 -0.226791 -0.089571 -0.090118 -0.073988 -0.075384 -0.134713 -0.135117 0.261505 0.265417 0.103564 0.079207 0.087981 0.084001 0.101147 0.093068 0.081542 0.092317 0.092950 0.123927 0.122049 0.084719 0.086407 0.077926 0.081001 0.087861 0.088356 0.092676 0.094527 0.093535 0.094081 0.079644 0.075839 0.080166 0.075242
qa: -0.2613 -0.3911 -0.3168 -0.3172 -0.1274 0.1328 -0.0403 -0.0731 -0.2563 -0.2781 -0.2283 0.3221 -0.0018 0.0934 -0.2116 -0.2268 -0.0896 -0.0901 -0.0740 -0.0754 -0.1347 -0.1351 0.2615 0.2654 0.1036 0.0792 0.0880 0.0840 0.1011 0.0931 0.0815 0.0923 0.0929 0.1239 0.1220 0.0847 0.0864 0.0779 0.0810 0.0879 0.0884 0.0927 0.0945 0.0935 0.0941 0.0796 0.0758 0.0802 0.0752
va: 2.1134 2.1047 2.1980 2.1980 3.1170 3.7535 3.8429 3.8283 3.8956 3.9142 3.8922 4.1983 3.7328 3.8985 3.9411 3.9468 3.6288 3.6228 3.9260 3.9271 3.8989 3.8978 4.2773 4.2743 1.0260 1.0328 1.0022 1.0019 1.0201 1.0065 1.0046 1.0001 1.0094 1.0039 1.0035 0.9990 0.9986 1.0098 1.0196 1.0008 1.0007 1.0078 1.0190 1.0082 1.0189 1.0117 1.0087 1.0118 1.0088
dispcorr: -0.022237035 hartree
energy: -1094.878522696156
dipole: 16.81908 -17.85402 -1.03494 -7.51922 6.94574 -0.57349 -11.98096 10.80967 -1.17130
magnitude: 1.66491 au
magnitude: 4.23188 debye
