program: Orca
programVersion: 5.0.2
elementType: O O O O N C C C C C C C C C C C C C C C C C C C H H H H H H H H H H H H H H H H H H H H H H H H H
charge: 0
multiplicity: 1
keywords: wb97x-d3
keywords: def2-TZVPP
keywords: def2/J RIJCOSX
keywords: DEFGRID2
keywords: scfconv7
keywords: smallprint printgap noloewdin
keywords: NOSOSCF
formula: C19H25NO4
InChI: InChI=1/C19H25NO4/c1-11(2)9-14-15(19(14,3)4)18(23)24-10-20-16(21)12-7-5-6-8-13(12)17(20)22/h9,14-15H,5-8,10H2,1-4H3
49 atoms
O  0.128447 0.400377 0.477633
O  1.661002 0.925635 2.010986
O  -2.462876 2.458201 -0.353307
O  -2.483401 -1.671041 1.56125
N  -2.144082 0.485983 0.805211
C  3.576211 0.971175 -0.467472
C  3.734793 -0.319215 0.276155
C  2.35464 0.127889 -0.136818
C  3.840552 2.268875 0.255014
C  3.966143 1.012904 -1.925046
C  4.331384 -1.528598 -0.344673
C  1.389226 0.531539 0.906599
C  5.622443 -1.856594 -0.283813
C  -0.887718 0.761891 1.405553
C  6.1407 -3.113375 -0.914029
C  6.650594 -1.018746 0.413412
C  -4.02919 0.62051 -0.507836
C  -4.034976 -0.588416 0.052964
C  -5.069721 1.140081 -1.42957
C  -5.095514 -1.610101 -0.13264
C  -5.95304 -0.015299 -1.906242
C  -6.32803 -0.956345 -0.760639
C  -2.814097 1.350877 -0.05776
C  -2.822032 -0.728054 0.903145
H  3.926452 -0.198596 1.33895
H  1.911296 -0.383993 -0.984467
H  3.248249 3.081299 -0.170776
H  4.892528 2.538887 0.142539
H  3.621604 2.215806 1.318034
H  5.038282 1.193084 -2.025188
H  3.442312 1.819811 -2.440188
H  3.745415 0.082068 -2.446084
H  3.655627 -2.194945 -0.872959
H  -0.825825 1.824319 1.642749
H  -0.796171 0.183004 2.324527
H  5.351827 -3.68024 -1.406853
H  6.604752 -3.764225 -0.168818
H  6.911205 -2.891383 -1.656594
H  7.098474 -1.566129 1.24665
H  6.246088 -0.086869 0.803708
H  7.468333 -0.767307 -0.266356
H  -5.666762 1.897239 -0.910765
H  -4.606223 1.657378 -2.27262
H  -4.715147 -2.41561 -0.769189
H  -5.340954 -2.079943 0.822352
H  -6.854103 0.378873 -2.378452
H  -5.420325 -0.579929 -2.676979
H  -7.014306 -1.726274 -1.116351
H  -6.865652 -0.393068 0.007818
totalener: -1094.85638364 hartree
nucrepener: 2025.89384464 hartree
electener: -3120.75022829 hartree
oneelecener: -5513.58450961 hartree
twoeener: 2392.83428132 hartree
kineticenergy: 1090.09460307 hartree
xcener: -105.970192700101 hartree
chargesum: 0.0000000
charge: -0.262998 -0.391213 -0.316254 -0.315933 -0.124666 0.107980 -0.029472 -0.105489 -0.275885 -0.239146 -0.183799 0.345872 -0.029363 0.091791 -0.211914 -0.233909 -0.090188 -0.092248 -0.073739 -0.075956 -0.135598 -0.135117 0.262606 0.264889 0.106410 0.074236 0.091180 0.082176 0.105749 0.085987 0.094966 0.079423 0.089070 0.123427 0.122956 0.078584 0.086633 0.083610 0.094357 0.080820 0.083607 0.093071 0.094371 0.093639 0.094495 0.079710 0.075844 0.080000 0.075429
qa: -0.2630 -0.3912 -0.3163 -0.3159 -0.1247 0.1080 -0.0295 -0.1055 -0.2759 -0.2391 -0.1838 0.3459 -0.0294 0.0918 -0.2119 -0.2339 -0.0902 -0.0922 -0.0737 -0.0760 -0.1356 -0.1351 0.2626 0.2649 0.1064 0.0742 0.0912 0.0822 0.1057 0.0860 0.0950 0.0794 0.0891 0.1234 0.1230 0.0786 0.0866 0.0836 0.0944 0.0808 0.0836 0.0931 0.0944 0.0936 0.0945 0.0797 0.0758 0.0800 0.0754
va: 2.1210 2.1080 2.1988 2.1994 3.1146 3.7068 3.8074 3.9365 3.9056 3.9061 3.8582 4.2144 3.7370 3.8983 3.9406 3.9419 3.6278 3.6233 3.9261 3.9269 3.8991 3.8973 4.2769 4.2747 1.0249 1.0357 1.0030 1.0015 1.0205 1.0046 1.0050 1.0076 1.0139 1.0020 1.0046 1.0108 0.9977 0.9988 1.0010 1.0112 1.0005 1.0081 1.0191 1.0083 1.0190 1.0117 1.0087 1.0118 1.0086
dispcorr: -0.022179759 hartree
energy: -1094.878563403348
dipole: 23.47507 -24.31575 -0.84068 -5.41047 4.99371 -0.41676 -12.16459 11.02645 -1.13814
magnitude: 1.47506 au
magnitude: 3.74930 debye
