program: Orca
programVersion: 5.0.2
elementType: O O O O N C C C C C C C C C C C C C C C C C C C H H H H H H H H H H H H H H H H H H H H H H H H H
charge: 0
multiplicity: 1
keywords: wb97x-d3
keywords: def2-TZVPP
keywords: def2/J RIJCOSX
keywords: DEFGRID2
keywords: scfconv7
keywords: smallprint printgap noloewdin
keywords: NOSOSCF
formula: C19H25NO4
InChI: InChI=1/C19H25NO4/c1-11(2)9-14-15(19(14,3)4)18(23)24-10-20-16(21)12-7-5-6-8-13(12)17(20)22/h9,14-15H,5-8,10H2,1-4H3
49 atoms
O  0.119772 0.877017 -0.016586
O  1.586476 2.203089 1.02055
O  -2.382386 0.063949 2.140161
O  -2.530991 1.647494 -2.124179
N  -2.158307 1.104577 0.090439
C  3.69857 0.454234 -0.504787
C  3.550864 -0.058738 0.892818
C  2.316873 0.139061 0.047057
C  4.14602 1.880536 -0.709122
C  4.190426 -0.482792 -1.581216
C  3.932267 -1.43526 1.303387
C  1.347685 1.191792 0.4138
C  5.180797 -1.859552 1.501777
C  -0.928927 1.779282 0.3124
C  5.466359 -3.260436 1.951085
C  6.386568 -0.991477 1.309914
C  -3.909944 -0.371535 0.314669
C  -3.952808 0.091619 -0.934232
C  -4.875327 -1.333505 0.902278
C  -4.960939 -0.294439 -1.952721
C  -6.104249 -1.440562 -0.002516
C  -5.71697 -1.537603 -1.478539
C  -2.749899 0.243066 1.013172
C  -2.824359 1.041349 -1.132292
H  3.673853 0.703047 1.659489
H  1.864914 -0.7609 -0.356075
H  3.794067 2.2676 -1.667267
H  5.237395 1.920106 -0.722921
H  3.798536 2.551459 0.071702
H  5.28111 -0.471839 -1.62824
H  3.813882 -0.17284 -2.557393
H  3.882721 -1.51331 -1.411129
H  3.117912 -2.132311 1.478966
H  -0.883156 2.663377 -0.323928
H  -0.866369 2.083528 1.356617
H  5.993424 -3.266181 2.908374
H  6.111903 -3.777984 1.237315
H  4.555967 -3.846882 2.068079
H  6.136066 0.012253 0.971903
H  7.070079 -1.432676 0.580185
H  6.948202 -0.900254 2.243079
H  -4.38972 -2.308177 1.015867
H  -5.153515 -1.023673 1.911985
H  -5.65023 0.540691 -2.114844
H  -4.478068 -0.469237 -2.916802
H  -6.70229 -2.305967 0.286579
H  -6.737694 -0.561517 0.147411
H  -6.607034 -1.68464 -2.091818
H  -5.08738 -2.419314 -1.628766
totalener: -1094.85569004 hartree
nucrepener: 2034.92344293 hartree
electener: -3129.77913296 hartree
oneelecener: -5531.64195904 hartree
twoeener: 2401.86282608 hartree
kineticenergy: 1090.09883936 hartree
xcener: -105.971042978212 hartree
chargesum: 0.0000000
charge: -0.264583 -0.391375 -0.315530 -0.316871 -0.128101 0.065460 -0.030996 -0.083159 -0.262706 -0.245702 -0.185150 0.347423 -0.023172 0.092391 -0.209314 -0.243443 -0.084166 -0.092690 -0.076431 -0.074481 -0.134708 -0.135965 0.261418 0.263262 0.108696 0.078336 0.087866 0.079019 0.106403 0.082912 0.099298 0.083509 0.090157 0.123673 0.123326 0.086465 0.083578 0.079475 0.083377 0.087889 0.098203 0.093128 0.093997 0.092556 0.095036 0.080206 0.075380 0.080091 0.076014
qa: -0.2646 -0.3914 -0.3155 -0.3169 -0.1281 0.0655 -0.0310 -0.0832 -0.2627 -0.2457 -0.1852 0.3474 -0.0232 0.0924 -0.2093 -0.2434 -0.0842 -0.0927 -0.0764 -0.0745 -0.1347 -0.1360 0.2614 0.2633 0.1087 0.0783 0.0879 0.0790 0.1064 0.0829 0.0993 0.0835 0.0902 0.1237 0.1233 0.0865 0.0836 0.0795 0.0834 0.0879 0.0982 0.0931 0.0940 0.0926 0.0950 0.0802 0.0754 0.0801 0.0760
va: 2.1169 2.1079 2.1984 2.1973 3.1193 3.7386 3.8214 3.8717 3.9057 3.9050 3.8607 4.2117 3.7363 3.8967 3.9366 3.9344 3.6141 3.6342 3.9278 3.9253 3.8966 3.8987 4.2784 4.2780 1.0255 1.0338 1.0031 1.0028 1.0221 1.0025 1.0059 1.0073 1.0127 1.0025 1.0065 0.9984 0.9990 1.0106 1.0111 0.9988 1.0037 1.0084 1.0190 1.0080 1.0189 1.0118 1.0087 1.0116 1.0088
dispcorr: -0.022552552 hartree
energy: -1094.878242587490
dipole: 23.58078 -24.33134 -0.75056 -15.26941 14.00564 -1.26377 -2.20396 1.69854 -0.50542
magnitude: 1.55432 au
magnitude: 3.95077 debye
