program: Orca
programVersion: 5.0.3
elementType: Cl F F F F F F F O O C C C C C C C C C C C C C C C C C H H H H H H H H H H H H H H
charge: 0
multiplicity: 1
keywords: wb97x-d3
keywords: def2-TZVPP
keywords: def2/J RIJCOSX
keywords: DEFGRID2
keywords: scfconv7
keywords: smallprint printgap noloewdin
keywords: NOSOSCF
formula: C17H14ClF7O2
InChI: InChI=1/C17H14ClF7O2/c1-6-11(19)13(21)7(14(22)12(6)20)5-27-15(26)10-8(16(10,2)3)4-9(18)17(23,24)25/h4,8,10H,5H2,1-3H3
41 atoms
Cl -4.072863 2.27015 0.260331
F  -4.667031 2.37543 -2.716844
F  -2.795297 1.501943 -3.32547
F  -2.818094 3.347983 -2.221194
F  2.998195 -0.199152 -1.587794
F  2.576018 -2.245257 2.624517
F  4.159685 -0.398688 3.685859
F  4.572506 1.650827 -0.523024
O  0.521252 -2.273236 0.5037
O  0.009787 -0.554379 -0.827548
C  -2.758859 -2.128242 0.245839
C  -2.808115 -0.616968 0.307977
C  -1.581034 -1.363479 0.784279
C  -2.652273 -2.834855 -1.082742
C  -3.603183 -2.86941 1.251919
C  -2.821447 0.183106 -0.918587
C  -0.292383 -1.321014 0.050625
C  -3.352366 1.393989 -1.045245
C  1.830689 -2.355443 -0.064977
C  -3.404049 2.151222 -2.332803
C  2.729598 -1.288673 0.486674
C  3.260306 -0.267052 -0.283427
C  3.059196 -1.286913 1.832157
C  3.885393 -0.326781 2.380943
C  4.087063 0.69216 0.269991
C  4.426791 0.691832 1.613066
C  5.32068 1.748124 2.182371
H  -3.400385 -0.213323 1.120867
H  -1.452682 -1.403129 1.861683
H  -3.635669 -2.913098 -1.549578
H  -1.988467 -2.351103 -1.798131
H  -2.277181 -3.848863 -0.933659
H  -3.188489 -3.859415 1.451142
H  -3.666622 -2.337681 2.201954
H  -4.619319 -3.003509 0.876142
H  -2.406075 -0.253609 -1.815862
H  1.78722 -2.319641 -1.152455
H  2.196309 -3.342624 0.212875
H  4.78797 2.695167 2.280773
H  5.692004 1.474658 3.166551
H  6.184112 1.921171 1.541553
elementType: Cl F O C H
totalener: -1965.99151464 hartree
nucrepener: 2777.20855508 hartree
electener: -4743.20006972 hartree
oneelecener: -8235.07883196 hartree
twoeener: 3491.87876224 hartree
cpcmener: -0.02324796 hartree
kineticenergy: 1959.80336457 hartree
xcener: -152.596660290896 hartree
chargesum: 0.0000000
charge: -0.076782 -0.175409 -0.171878 -0.174475 -0.203630 -0.203465 -0.208249 -0.207052 -0.274824 -0.438380 0.067682 0.035047 -0.079258 -0.265229 -0.253865 -0.159928 0.397381 -0.084390 0.054929 0.511250 -0.200470 0.299553 0.218763 0.234347 0.207963 -0.151874 -0.208051 0.092938 0.113250 0.108300 0.091376 0.102880 0.095791 0.090135 0.096985 0.134178 0.120155 0.139436 0.115334 0.100508 0.109026
qa: -0.0768 -0.1754 -0.1719 -0.1745 -0.2036 -0.2035 -0.2082 -0.2071 -0.2748 -0.4384 0.0677 0.0350 -0.0793 -0.2652 -0.2539 -0.1599 0.3974 -0.0844 0.0549 0.5112 -0.2005 0.2996 0.2188 0.2343 0.2080 -0.1519 -0.2081 0.0929 0.1133 0.1083 0.0914 0.1029 0.0958 0.0901 0.0970 0.1342 0.1202 0.1394 0.1153 0.1005 0.1090
va: 1.2587 1.1219 1.1312 1.1247 1.0941 1.0961 1.0892 1.0931 2.1275 2.0720 3.8284 3.7612 3.8357 3.9018 3.8912 3.8705 4.1657 4.0006 3.8525 4.4839 3.6340 3.8306 3.9646 3.8829 3.9511 3.7390 3.9151 1.0286 1.0204 0.9990 1.0128 1.0020 1.0028 1.0051 1.0011 1.0251 1.0198 0.9935 0.9958 1.0118 1.0003
dispcorr: -0.019723835 hartree
energy: -1966.011238471483
dipole: -3.85401 4.45573 0.60172 -27.36859 25.22608 -2.14251 10.38092 -9.10372 1.27720
magnitude: 2.56587 au
magnitude: 6.52191 debye
