program: Orca
programVersion: 5.0.3
elementType: Cl F F F F F F F O O C C C C C C C C C C C C C C C C C H H H H H H H H H H H H H H
charge: 0
multiplicity: 1
keywords: wb97x-d3
keywords: def2-TZVPP
keywords: def2/J RIJCOSX
keywords: DEFGRID2
keywords: scfconv7
keywords: smallprint printgap noloewdin
keywords: NOSOSCF
formula: C17H14ClF7O2
InChI: InChI=1/C17H14ClF7O2/c1-6-11(19)13(21)7(14(22)12(6)20)5-27-15(26)10-8(16(10,2)3)4-9(18)17(23,24)25/h4,8,10H,5H2,1-3H3
41 atoms
Cl -1.467254 0.921919 1.700706
F  -2.310633 3.259855 0.007293
F  -2.088539 2.261229 -1.886706
F  -0.382278 2.539237 -0.604097
F  1.259535 -0.853313 2.379548
F  3.071701 -1.193849 -1.942384
F  3.67375 1.393907 -1.891573
F  1.795568 1.756969 2.397367
O  0.421598 -2.795267 0.5460
O  -0.248579 -1.720957 -1.291649
C  -3.114567 -2.641572 -0.489048
C  -2.872399 -1.340876 0.194725
C  -1.851505 -2.469779 0.329504
C  -3.075911 -2.750609 -1.99244
C  -4.146275 -3.548476 0.141671
C  -2.53902 -0.101093 -0.532469
C  -0.51209 -2.283334 -0.256982
C  -1.970044 0.94611 0.050469
C  1.787344 -2.569104 0.205881
C  -1.689065 2.253017 -0.617058
C  2.138754 -1.10765 0.217017
C  1.841915 -0.309815 1.310067
C  2.756352 -0.487386 -0.854783
C  3.065751 0.85893 -0.829075
C  2.127782 1.0409 1.320535
C  2.758416 1.663654 0.255493
C  3.063455 3.128744 0.264582
H  -3.425018 -1.166718 1.11341
H  -1.845019 -2.96594 1.292505
H  -4.056355 -2.498028 -2.400672
H  -2.343727 -2.106955 -2.471708
H  -2.853663 -3.777284 -2.288935
H  -5.141137 -3.324856 -0.247928
H  -3.930019 -4.595584 -0.076977
H  -4.181607 -3.435332 1.22608
H  -2.806799 -0.023595 -1.57948
H  2.023141 -3.023625 -0.756048
H  2.355053 -3.103302 0.966679
H  3.940066 3.359059 -0.336726
H  2.225801 3.698572 -0.140774
H  3.251738 3.4921 1.272343
elementType: Cl F O C H
totalener: -1965.98905085 hartree
nucrepener: 3047.16039780 hartree
electener: -5013.14944865 hartree
oneelecener: -8775.91285276 hartree
twoeener: 3762.76340411 hartree
cpcmener: -0.02073794 hartree
kineticenergy: 1959.81886460 hartree
xcener: -152.601453634037 hartree
chargesum: -0.0000000
charge: -0.072238 -0.173362 -0.169426 -0.165106 -0.201176 -0.206962 -0.208536 -0.206991 -0.278288 -0.453317 0.110194 -0.085755 -0.077088 -0.286117 -0.255357 -0.079718 0.390066 -0.067052 0.066621 0.503382 -0.130911 0.173349 0.263201 0.236286 0.214042 -0.160441 -0.209079 0.119748 0.096713 0.102814 0.095067 0.100273 0.096350 0.098840 0.088722 0.149527 0.121348 0.135405 0.106664 0.112230 0.106079
qa: -0.0722 -0.1734 -0.1694 -0.1651 -0.2012 -0.2070 -0.2085 -0.2070 -0.2783 -0.4533 0.1102 -0.0858 -0.0771 -0.2861 -0.2554 -0.0797 0.3901 -0.0671 0.0666 0.5034 -0.1309 0.1733 0.2632 0.2363 0.2140 -0.1604 -0.2091 0.1197 0.0967 0.1028 0.0951 0.1003 0.0963 0.0988 0.0887 0.1495 0.1213 0.1354 0.1067 0.1122 0.1061
va: 1.2711 1.1275 1.1359 1.1239 1.0898 1.0908 1.0906 1.0868 2.1265 2.0402 3.7969 3.8636 3.8730 3.8949 3.8974 3.7819 4.0891 3.9466 3.8549 4.4747 3.5889 3.9431 3.8845 3.9230 3.8880 3.7085 3.9093 1.0120 1.0314 0.9981 1.0180 1.0005 1.0023 1.0022 1.0043 1.0054 1.0165 0.9910 1.0060 1.0017 1.0050
dispcorr: -0.024179628 hartree
energy: -1966.013230474349
dipole: -18.45850 17.68383 -0.77467 -28.03941 26.55640 -1.48300 -5.01110 5.50235 0.49125
magnitude: 1.74377 au
magnitude: 4.43232 debye
