program: Orca
programVersion: 5.0.3
elementType: Cl F F F F F F F O O C C C C C C C C C C C C C C C C C H H H H H H H H H H H H H H
charge: 0
multiplicity: 1
keywords: wb97x-d3
keywords: def2-TZVPP
keywords: def2/J RIJCOSX
keywords: DEFGRID2
keywords: scfconv7
keywords: smallprint printgap noloewdin
keywords: NOSOSCF
formula: C17H14ClF7O2
InChI: InChI=1/C17H14ClF7O2/c1-6-11(19)13(21)7(14(22)12(6)20)5-27-15(26)10-8(16(10,2)3)4-9(18)17(23,24)25/h4,8,10H,5H2,1-3H3
41 atoms
Cl -4.917807 2.16327 0.514441
F  -4.273135 3.319226 -2.198385
F  -5.861591 1.881433 -2.336602
F  -3.928056 1.425114 -3.165793
F  3.243757 1.765109 0.11486
F  3.182071 -2.932851 0.047043
F  5.358493 -2.976226 1.591769
F  5.408896 1.720645 1.649622
O  0.80791 -0.632226 0.146246
O  -0.628666 -0.793457 -1.55185
C  -2.64747 -1.652078 0.687789
C  -2.817476 -0.165669 0.544354
C  -1.425208 -0.765184 0.718019
C  -2.931932 -2.573304 -0.472897
C  -3.047167 -2.244417 2.019149
C  -3.244424 0.441455 -0.718353
C  -0.419384 -0.736776 -0.36809
C  -4.128974 1.424913 -0.830254
C  1.889917 -0.564333 -0.784159
C  -4.548178 2.014877 -2.143129
C  3.146708 -0.581663 0.027553
C  3.749642 0.585384 0.465497
C  3.720076 -1.778011 0.432548
C  4.84887 -1.800402 1.226179
C  4.88202 0.560341 1.260815
C  5.46152 -0.633331 1.659341
C  6.686916 -0.691509 2.51851
H  -3.172545 0.345285 1.431533
H  -0.995938 -0.60693 1.700202
H  -4.001899 -2.781857 -0.515871
H  -2.62886 -2.18115 -1.438431
H  -2.415966 -3.523949 -0.33022
H  -2.491738 -3.163323 2.21553
H  -2.860893 -1.559904 2.84776
H  -4.110758 -2.488727 2.024384
H  -2.811054 0.065648 -1.634156
H  1.816921 0.345354 -1.38136
H  1.856742 -1.408023 -1.473999
H  7.454527 -1.314905 2.061147
H  7.110262 0.295306 2.679934
H  6.457187 -1.120611 3.494226
totalener: -1965.97935011 hartree
nucrepener: 2691.77492089 hartree
electener: -4657.75427101 hartree
oneelecener: -8063.39492905 hartree
twoeener: 3405.64065804 hartree
kineticenergy: 1959.83729859 hartree
xcener: -152.599600919585 hartree
chargesum: 0.0000000
charge: -0.061046 -0.162058 -0.162972 -0.165867 -0.185855 -0.187493 -0.187568 -0.189366 -0.255787 -0.396584 0.058499 0.056389 -0.095930 -0.249327 -0.231120 -0.196973 0.363844 -0.080817 0.051457 0.505026 -0.229358 0.266369 0.259936 0.203151 0.219638 -0.161815 -0.201082 0.079188 0.089068 0.095568 0.103186 0.090362 0.092354 0.074944 0.093958 0.153697 0.116432 0.114702 0.105365 0.101905 0.105982
qa: -0.0610 -0.1621 -0.1630 -0.1659 -0.1859 -0.1875 -0.1876 -0.1894 -0.2558 -0.3966 0.0585 0.0564 -0.0959 -0.2493 -0.2311 -0.1970 0.3638 -0.0808 0.0515 0.5050 -0.2294 0.2664 0.2599 0.2032 0.2196 -0.1618 -0.2011 0.0792 0.0891 0.0956 0.1032 0.0904 0.0924 0.0749 0.0940 0.1537 0.1164 0.1147 0.1054 0.1019 0.1060
va: 1.2763 1.1434 1.1408 1.1384 1.1207 1.1184 1.1174 1.1125 2.1429 2.0881 3.7918 3.7327 3.9417 3.9100 3.9136 3.8754 4.1367 4.0483 3.8562 4.4852 3.7559 3.9071 3.8956 3.9507 3.9085 3.7477 3.9208 1.0375 1.0297 1.0015 1.0189 1.0019 1.0042 1.0086 1.0041 1.0309 1.0066 1.0068 1.0007 1.0140 0.9990
dispcorr: -0.018473299 hartree
energy: -1965.997823411996
dipole: 2.99119 -1.83846 1.15273 -24.79222 23.76858 -1.02364 14.21802 -12.92910 1.28892
magnitude: 2.00946 au
magnitude: 5.10764 debye
