program: Orca
programVersion: 5.0.3
elementType: Cl F F F F F F F O O C C C C C C C C C C C C C C C C C H H H H H H H H H H H H H H
charge: 0
multiplicity: 1
keywords: wb97x-d3
keywords: def2-TZVPP
keywords: def2/J RIJCOSX
keywords: DEFGRID2
keywords: scfconv7
keywords: smallprint printgap noloewdin
keywords: NOSOSCF
formula: C17H14ClF7O2
InChI: InChI=1/C17H14ClF7O2/c1-6-11(19)13(21)7(14(22)12(6)20)5-27-15(26)10-8(16(10,2)3)4-9(18)17(23,24)25/h4,8,10H,5H2,1-3H3
41 atoms
Cl -4.704948 1.308287 1.074394
F  -5.602096 2.006476 -1.745303
F  -3.61997 1.969105 -2.58952
F  -4.098552 3.351709 -1.010297
F  4.586844 -2.267936 -0.721051
F  1.812054 1.289375 0.587426
F  3.69729 2.133571 2.28205
F  6.475648 -1.405387 0.933563
O  0.942081 -1.362646 -0.22401
O  -0.474825 -0.987096 -1.910231
C  -2.57349 -2.375222 -0.067324
C  -2.65275 -0.919746 0.298733
C  -1.301009 -1.628379 0.253687
C  -2.894319 -2.837353 -1.467549
C  -3.037144 -3.349661 0.990323
C  -3.034208 0.107392 -0.673975
C  -0.27877 -1.290041 -0.762549
C  -3.897675 1.088255 -0.435055
C  2.046322 -0.969076 -1.036946
C  -4.302859 2.1106 -1.453922
C  3.135509 -0.51696 -0.11349
C  4.343707 -1.179884 0.008419
C  2.951651 0.60933 0.676371
C  3.928134 1.046401 1.547077
C  5.327151 -0.731746 0.875015
C  5.14224 0.384995 1.67248
C  6.196732 0.88044 2.613961
H  -2.988158 -0.720416 1.309497
H  -0.879451 -1.829724 1.23117
H  -3.973118 -2.965194 -1.567683
H  -2.563723 -2.160495 -2.248654
H  -2.429302 -3.806085 -1.656877
H  -2.811712 -3.000725 1.998658
H  -4.116104 -3.497533 0.925352
H  -2.557666 -4.320915 0.859161
H  -2.589509 0.06885 -1.658918
H  1.757539 -0.163653 -1.714064
H  2.370078 -1.80942 -1.651145
H  5.762873 1.187942 3.563421
H  6.941456 0.116454 2.817917
H  6.713907 1.744811 2.195558
totalener: -1965.97807448 hartree
nucrepener: 2718.61439234 hartree
electener: -4684.59246681 hartree
oneelecener: -8117.17641874 hartree
twoeener: 3432.58395193 hartree
kineticenergy: 1959.82571109 hartree
xcener: -152.598143060489 hartree
chargesum: -0.0000000
charge: -0.061625 -0.163102 -0.165519 -0.161875 -0.189101 -0.184535 -0.187143 -0.189752 -0.262484 -0.397369 0.066150 0.045206 -0.093209 -0.248576 -0.229954 -0.194599 0.370930 -0.076663 0.031334 0.504240 -0.183416 0.252985 0.220926 0.223752 0.229660 -0.176103 -0.202461 0.080118 0.089966 0.094136 0.104165 0.089675 0.074668 0.094174 0.091215 0.153571 0.125000 0.110982 0.105716 0.102562 0.106356
qa: -0.0616 -0.1631 -0.1655 -0.1619 -0.1891 -0.1845 -0.1871 -0.1898 -0.2625 -0.3974 0.0662 0.0452 -0.0932 -0.2486 -0.2300 -0.1946 0.3709 -0.0767 0.0313 0.5042 -0.1834 0.2530 0.2209 0.2238 0.2297 -0.1761 -0.2025 0.0801 0.0900 0.0941 0.1042 0.0897 0.0747 0.0942 0.0912 0.1536 0.1250 0.1110 0.1057 0.1026 0.1064
va: 1.2755 1.1392 1.1391 1.1449 1.1139 1.1201 1.1178 1.1127 2.1347 2.0865 3.7879 3.7533 3.9394 3.9096 3.9131 3.8819 4.1240 4.0414 3.8715 4.4880 3.7003 3.8949 3.9255 3.9506 3.9102 3.7721 3.9215 1.0375 1.0291 1.0015 1.0191 1.0021 1.0086 1.0042 1.0044 1.0303 1.0062 1.0105 1.0030 1.0113 0.9984
dispcorr: -0.018641633 hartree
energy: -1965.996716111266
dipole: 1.89898 -0.85714 1.04184 -28.28456 27.16262 -1.12195 4.74773 -3.84496 0.90277
magnitude: 1.77741 au
magnitude: 4.51782 debye
