program: Orca
programVersion: 5.0.3
elementType: Cl F F F F F F F O O C C C C C C C C C C C C C C C C C H H H H H H H H H H H H H H
charge: 0
multiplicity: 1
keywords: wb97x-d3
keywords: def2-TZVPP
keywords: def2/J RIJCOSX
keywords: DEFGRID2
keywords: scfconv7
keywords: smallprint printgap noloewdin
keywords: NOSOSCF
formula: C17H14ClF7O2
InChI: InChI=1/C17H14ClF7O2/c1-6-11(19)13(21)7(14(22)12(6)20)5-27-15(26)10-8(16(10,2)3)4-9(18)17(23,24)25/h4,8,10H,5H2,1-3H3
41 atoms
Cl -4.525934 1.968368 0.456714
F  -3.574667 3.167279 -2.1798
F  -5.467288 2.169874 -2.352063
F  -3.721332 1.322087 -3.281725
F  2.450906 1.486108 -0.619525
F  3.544453 -2.794319 0.965551
F  5.481015 -1.730196 2.481268
F  4.376516 2.543539 0.885379
O  0.687799 -1.31829 0.11267
O  -0.628285 -1.45105 -1.688371
C  -2.866748 -2.198394 0.33944
C  -2.898098 -0.695994 0.313622
C  -1.577913 -1.436229 0.520744
C  -3.149081 -3.004764 -0.90456
C  -3.406802 -2.849564 1.591901
C  -3.180275 0.065827 -0.90537
C  -0.499468 -1.406064 -0.493312
C  -3.870481 1.200432 -0.94322
C  1.848496 -1.26482 -0.716825
C  -4.157822 1.966907 -2.199973
C  2.951533 -0.686617 0.114185
C  3.190786 0.67733 0.135294
C  3.742056 -1.478492 0.933207
C  4.739687 -0.929917 1.715068
C  4.191258 1.224845 0.9193
C  4.988749 0.434792 1.731592
C  6.071515 0.99989 2.59945
H  -3.260566 -0.23003 1.221912
H  -1.205921 -1.388934 1.537261
H  -4.226195 -3.141463 -1.009576
H  -2.775979 -2.559944 -1.82109
H  -2.698434 -3.994497 -0.817943
H  -2.946057 -3.825845 1.74899
H  -3.220341 -2.248142 2.482048
H  -4.484509 -2.996915 1.512336
H  -2.804681 -0.315274 -1.845117
H  1.665856 -0.65355 -1.599872
H  2.100187 -2.268465 -1.062793
H  7.038697 0.563959 2.350955
H  6.152971 2.076895 2.488729
H  5.878256 0.785974 3.650388
totalener: -1965.97851864 hartree
nucrepener: 2713.03810852 hartree
electener: -4679.01662716 hartree
oneelecener: -8105.99483730 hartree
twoeener: 3426.97821014 hartree
kineticenergy: 1959.82720923 hartree
xcener: -152.597679919822 hartree
chargesum: 0.0000000
charge: -0.060723 -0.161286 -0.162652 -0.166078 -0.185822 -0.187207 -0.187886 -0.189100 -0.258022 -0.394669 0.062950 0.045029 -0.092697 -0.249016 -0.231249 -0.187864 0.367415 -0.079669 0.046087 0.505459 -0.222031 0.265812 0.261629 0.196513 0.224466 -0.163316 -0.198892 0.078129 0.088364 0.093017 0.103968 0.089488 0.092607 0.074543 0.093399 0.147147 0.115499 0.114487 0.105543 0.101310 0.105318
qa: -0.0607 -0.1613 -0.1627 -0.1661 -0.1858 -0.1872 -0.1879 -0.1891 -0.2580 -0.3947 0.0630 0.0450 -0.0927 -0.2490 -0.2312 -0.1879 0.3674 -0.0797 0.0461 0.5055 -0.2220 0.2658 0.2616 0.1965 0.2245 -0.1633 -0.1989 0.0781 0.0884 0.0930 0.1040 0.0895 0.0926 0.0745 0.0934 0.1471 0.1155 0.1145 0.1055 0.1013 0.1053
va: 1.2771 1.1431 1.1423 1.1388 1.1195 1.1186 1.1171 1.1127 2.1403 2.0905 3.7849 3.7501 3.9240 3.9092 3.9130 3.8924 4.1397 4.0503 3.8612 4.4870 3.7594 3.9005 3.8994 3.9552 3.9098 3.7466 3.9202 1.0397 1.0301 1.0013 1.0199 1.0017 1.0042 1.0087 1.0044 1.0302 1.0136 1.0023 0.9999 1.0145 0.9996
dispcorr: -0.018476490 hartree
energy: -1965.996995131762
dipole: -0.86797 1.76287 0.89490 -27.46384 26.46963 -0.99421 11.72038 -10.50917 1.21121
magnitude: 1.80453 au
magnitude: 4.58674 debye
