program: Orca
programVersion: 5.0.3
elementType: Cl F F F F F F F O O C C C C C C C C C C C C C C C C C H H H H H H H H H H H H H H
charge: 0
multiplicity: 1
keywords: wb97x-d3
keywords: def2-TZVPP
keywords: def2/J RIJCOSX
keywords: DEFGRID2
keywords: scfconv7
keywords: smallprint printgap noloewdin
keywords: NOSOSCF
formula: C17H14ClF7O2
InChI: InChI=1/C17H14ClF7O2/c1-6-11(19)13(21)7(14(22)12(6)20)5-27-15(26)10-8(16(10,2)3)4-9(18)17(23,24)25/h4,8,10H,5H2,1-3H3
41 atoms
Cl -4.478548 1.882475 0.438246
F  -5.041952 2.243786 -2.476754
F  -3.099547 1.632151 -3.177133
F  -3.299197 3.361987 -1.910186
F  1.698862 0.845952 -0.326445
F  4.2830 -2.824336 1.044912
F  5.937389 -1.17163 2.330825
F  3.3419 2.49813 0.974733
O  0.740081 -1.903211 0.284993
O  -0.426918 -1.518782 -1.590548
C  -2.871702 -2.205296 0.228635
C  -2.743318 -0.709274 0.30202
C  -1.526187 -1.594892 0.543041
C  -3.13624 -2.894558 -1.087232
C  -3.565447 -2.874857 1.39156
C  -2.882115 0.148365 -0.879277
C  -0.384867 -1.65394 -0.397169
C  -3.603581 1.263526 -0.915594
C  1.981692 -1.925339 -0.415518
C  -3.757906 2.128583 -2.130552
C  2.943447 -1.033325 0.310924
C  2.741198 0.337714 0.325968
C  4.037604 -1.51537 1.0097
C  4.894513 -0.659474 1.677568
C  3.594207 1.19047 0.999731
C  4.696567 0.712044 1.692416
C  5.62754 1.614146 2.443312
H  -3.122098 -0.266796 1.215603
H  -1.2237 -1.653712 1.581708
H  -2.798034 -3.930932 -1.040651
H  -4.209707 -2.906775 -1.280804
H  -2.648713 -2.431783 -1.939371
H  -3.22885 -3.907299 1.499438
H  -3.373596 -2.362977 2.335061
H  -4.645151 -2.889504 1.23634
H  -2.368625 -0.141233 -1.785877
H  1.851842 -1.596186 -1.446723
H  2.342633 -2.952666 -0.437548
H  6.667378 1.358671 2.24733
H  5.481747 2.655439 2.17126
H  5.466348 1.526178 3.518364
totalener: -1965.97747901 hartree
nucrepener: 2744.38692405 hartree
electener: -4710.36440306 hartree
oneelecener: -8168.84162655 hartree
twoeener: 3458.47722348 hartree
kineticenergy: 1959.82593195 hartree
xcener: -152.598661728575 hartree
chargesum: 0.0000000
charge: -0.063047 -0.163376 -0.165545 -0.161767 -0.182769 -0.189663 -0.188243 -0.188225 -0.268951 -0.396065 0.063867 0.040668 -0.108062 -0.250901 -0.230999 -0.186352 0.390587 -0.075885 0.033730 0.504703 -0.179316 0.238124 0.232074 0.222687 0.233475 -0.180543 -0.200214 0.078778 0.090003 0.090168 0.095084 0.103228 0.091289 0.074736 0.094174 0.153157 0.132443 0.103804 0.104851 0.102635 0.105658
qa: -0.0630 -0.1634 -0.1655 -0.1618 -0.1828 -0.1897 -0.1882 -0.1882 -0.2690 -0.3961 0.0639 0.0407 -0.1081 -0.2509 -0.2310 -0.1864 0.3906 -0.0759 0.0337 0.5047 -0.1793 0.2381 0.2321 0.2227 0.2335 -0.1805 -0.2002 0.0788 0.0900 0.0902 0.0951 0.1032 0.0913 0.0747 0.0942 0.1532 0.1324 0.1038 0.1049 0.1026 0.1057
va: 1.2745 1.1401 1.1397 1.1440 1.1240 1.1131 1.1164 1.1148 2.1274 2.0927 3.7910 3.7561 3.9211 3.9136 3.9119 3.8825 4.1229 4.0374 3.8675 4.4888 3.6988 3.9038 3.9106 3.9346 3.9320 3.7725 3.9213 1.0379 1.0314 1.0015 1.0017 1.0192 1.0042 1.0087 1.0042 1.0295 1.0162 1.0082 1.0022 1.0124 0.9982
dispcorr: -0.018914723 hartree
energy: -1965.996393732570
dipole: -2.78954 3.55097 0.76143 -26.98999 25.95333 -1.03665 10.10331 -8.96767 1.13565
magnitude: 1.71584 au
magnitude: 4.36133 debye
