program: Orca
programVersion: 5.0.3
elementType: Cl F F F F F F F O O C C C C C C C C C C C C C C C C C H H H H H H H H H H H H H H
charge: 0
multiplicity: 1
keywords: wb97x-d3
keywords: def2-TZVPP
keywords: def2/J RIJCOSX
keywords: DEFGRID2
keywords: scfconv7
keywords: smallprint printgap noloewdin
keywords: NOSOSCF
formula: C17H14ClF7O2
InChI: InChI=1/C17H14ClF7O2/c1-6-11(19)13(21)7(14(22)12(6)20)5-27-15(26)10-8(16(10,2)3)4-9(18)17(23,24)25/h4,8,10H,5H2,1-3H3
41 atoms
Cl -4.507421 1.858204 0.1216
F  -5.223598 1.941807 -2.796729
F  -3.363991 1.120512 -3.511673
F  -3.380691 2.98211 -2.430243
F  2.225327 1.597974 -0.465802
F  3.618471 -2.628593 1.035021
F  5.446574 -1.482249 2.590759
F  4.063045 2.748939 1.096221
O  0.642523 -1.295662 0.16543
O  -0.562316 -1.670118 -1.675957
C  -2.89749 -2.353116 0.240728
C  -2.940891 -0.852787 0.173108
C  -1.627528 -1.577259 0.477214
C  -3.109157 -3.197521 -0.99212
C  -3.505739 -2.972265 1.478666
C  -3.126695 -0.122993 -1.082947
C  -0.500541 -1.533374 -0.482378
C  -3.772919 1.031005 -1.202357
C  1.824986 -1.190138 -0.628927
C  -3.934475 1.770145 -2.49668
C  2.8730 -0.552545 0.228306
C  3.012082 0.82653 0.280474
C  3.713321 -1.300999 1.035226
C  4.665846 -0.703043 1.842002
C  3.963307 1.42066 1.085539
C  4.814926 0.673706 1.88661
C  5.83498 1.350002 2.750458
H  -3.36311 -0.362823 1.042163
H  -1.311658 -1.497149 1.510629
H  -2.658022 -4.180931 -0.852163
H  -4.178794 -3.3450 -1.147692
H  -2.691183 -2.777896 -1.900759
H  -3.062925 -3.949434 1.678022
H  -3.357204 -2.35422 2.364876
H  -4.579888 -3.11165 1.34866
H  -2.69932 -0.541234 -1.983786
H  1.637183 -0.592284 -1.520507
H  2.137419 -2.180358 -0.963299
H  5.353447 1.946137 3.525841
H  6.485859 0.631574 3.239672
H  6.459336 2.022677 2.16359
totalener: -1965.97864191 hartree
nucrepener: 2722.29645682 hartree
electener: -4688.27509874 hartree
oneelecener: -8124.52174696 hartree
twoeener: 3436.24664823 hartree
kineticenergy: 1959.83138188 hartree
xcener: -152.598392687638 hartree
chargesum: -0.0000000
charge: -0.059730 -0.162690 -0.165813 -0.161103 -0.185428 -0.187289 -0.190458 -0.186483 -0.256842 -0.394616 0.063830 0.048451 -0.091426 -0.245838 -0.231860 -0.194422 0.364506 -0.080666 0.047370 0.505098 -0.225506 0.266315 0.263821 0.218299 0.201387 -0.162605 -0.198956 0.077774 0.088071 0.088857 0.091910 0.104025 0.092573 0.074830 0.093845 0.148960 0.115328 0.114472 0.106257 0.100883 0.104867
qa: -0.0597 -0.1627 -0.1658 -0.1611 -0.1854 -0.1873 -0.1905 -0.1865 -0.2568 -0.3946 0.0638 0.0485 -0.0914 -0.2458 -0.2319 -0.1944 0.3645 -0.0807 0.0474 0.5051 -0.2255 0.2663 0.2638 0.2183 0.2014 -0.1626 -0.1990 0.0778 0.0881 0.0889 0.0919 0.1040 0.0926 0.0748 0.0938 0.1490 0.1153 0.1145 0.1063 0.1009 0.1049
va: 1.2783 1.1420 1.1391 1.1439 1.1206 1.1187 1.1111 1.1189 2.1428 2.0906 3.7845 3.7532 3.9264 3.9061 3.9127 3.8900 4.1409 4.0542 3.8592 4.4862 3.7544 3.8877 3.9107 3.9058 3.9581 3.7483 3.9211 1.0390 1.0298 1.0021 1.0012 1.0205 1.0044 1.0083 1.0043 1.0293 1.0114 1.0039 0.9990 1.0143 1.0007
dispcorr: -0.018501528 hartree
energy: -1965.997143439841
dipole: -2.08770 2.86876 0.78105 -27.46876 26.59168 -0.87708 12.47298 -11.20521 1.26777
magnitude: 1.72817 au
magnitude: 4.39265 debye
