program: Orca
programVersion: 5.0.2
elementType: Si F O O C C C C C C C C C C C C C C C C C C C C C C C C C H H H H H H H H H H H H H H H H H H H H H H H H H H H H H
charge: 0
multiplicity: 1
keywords: wb97x-d3
keywords: def2-TZVPP
keywords: def2/J RIJCOSX
keywords: DEFGRID2
keywords: scfconv7
keywords: smallprint printgap noloewdin
keywords: NOSOSCF
formula: C25H29FO2Si
InChI: InChI=1/C25H29FO2Si/c1-4-27-21-13-15-23(16-14-21)29(2,3)18-8-9-20-12-17-24(26)25(19-20)28-22-10-6-5-7-11-22/h5-7,10-17,19H,4,8-9,18H2,1-3H3
58 atoms
Si -3.493338 1.309022 0.857571
F  1.844507 -3.83526 0.341958
O  2.367495 2.656199 0.110001
O  1.618628 -1.639431 -1.318939
C  -3.654972 -0.51852 0.398773
C  -3.558945 -0.769831 -1.106591
C  -1.691752 1.801072 0.598757
C  -3.962735 1.566731 2.660826
C  -4.589178 2.347802 -0.266585
C  -3.230642 -2.218099 -1.47084
C  -1.153023 1.968228 -0.678079
C  -0.807237 1.953642 1.672315
C  -1.877473 -2.652618 -0.975094
C  0.190277 2.252983 -0.892943
C  0.530998 2.252513 1.485314
C  1.046176 2.397139 0.196159
C  -0.7335 -1.932683 -1.322194
C  -1.733327 -3.761625 -0.150306
C  0.517143 -2.320607 -0.877646
C  -0.483373 -4.163959 0.303672
C  0.629558 -3.447432 -0.071224
C  2.969787 2.879677 -1.161343
C  2.698825 4.266281 -1.705026
C  2.498814 -1.084469 -0.423672
C  3.752244 -0.761857 -0.929922
C  2.179477 -0.818962 0.9004
C  4.697686 -0.183646 -0.097337
C  3.141857 -0.247947 1.723691
C  4.401186 0.069937 1.236099
H  -2.858001 -1.053259 0.927688
H  -4.593448 -0.92925 0.784071
H  -2.802574 -0.125009 -1.562872
H  -4.501669 -0.489633 -1.582501
H  -3.82474 2.603205 2.974684
H  -5.013551 1.315863 2.820116
H  -3.376929 0.936668 3.332801
H  -4.287474 2.272927 -1.313268
H  -5.632056 2.029205 -0.206003
H  -4.552049 3.404023 0.007746
H  -3.994322 -2.884576 -1.063266
H  -3.269413 -2.329097 -2.558444
H  -1.787144 1.881767 -1.553187
H  -1.162844 1.839257 2.690103
H  0.541206 2.36239 -1.910107
H  1.188593 2.365466 2.338772
H  -0.803774 -1.058993 -1.959859
H  -2.606791 -4.330272 0.142305
H  -0.374935 -5.034303 0.937421
H  2.668506 2.106015 -1.873114
H  4.038186 2.751284 -0.988907
H  1.643407 4.438507 -1.916095
H  3.038779 5.033468 -1.008832
H  3.246956 4.398077 -2.63837
H  3.983091 -0.966774 -1.967904
H  1.195626 -1.035486 1.297315
H  5.673021 0.06348 -0.496258
H  2.893401 -0.042971 2.75687
H  5.142742 0.515369 1.885779
elementType: Si F O C H
totalener: -1510.05223768 hartree
nucrepener: 3014.96833836 hartree
electener: -4525.02057605 hartree
oneelecener: -8061.34684598 hartree
twoeener: 3536.32626993 hartree
cpcmener: -0.02925217 hartree
kineticenergy: 1503.91308585 hartree
xcener: -135.235732398295 hartree
chargesum: -0.0000000
charge: 0.490160 -0.218866 -0.346769 -0.336878 -0.245540 -0.130521 -0.152076 -0.465443 -0.428439 -0.098510 -0.188684 -0.076441 -0.018152 -0.243725 -0.334536 0.364393 -0.246049 -0.156176 0.188628 -0.174194 0.248493 0.041645 -0.268616 0.318546 -0.270158 -0.158359 -0.141231 -0.185891 -0.172250 0.080382 0.088238 0.073608 0.092817 0.106972 0.107291 0.101594 0.103954 0.107944 0.108385 0.081282 0.098936 0.152420 0.143253 0.140794 0.134375 0.140216 0.144108 0.150823 0.091595 0.110662 0.092626 0.088774 0.095971 0.143674 0.147243 0.159750 0.159062 0.158890
qa: 0.4902 -0.2189 -0.3468 -0.3369 -0.2455 -0.1305 -0.1521 -0.4654 -0.4284 -0.0985 -0.1887 -0.0764 -0.0182 -0.2437 -0.3345 0.3644 -0.2460 -0.1562 0.1886 -0.1742 0.2485 0.0416 -0.2686 0.3185 -0.2702 -0.1584 -0.1412 -0.1859 -0.1722 0.0804 0.0882 0.0736 0.0928 0.1070 0.1073 0.1016 0.1040 0.1079 0.1084 0.0813 0.0989 0.1524 0.1433 0.1408 0.1344 0.1402 0.1441 0.1508 0.0916 0.1107 0.0926 0.0888 0.0960 0.1437 0.1472 0.1597 0.1591 0.1589
va: 4.1267 1.0656 2.0244 2.0455 3.8154 3.8780 3.7275 3.9300 3.8847 3.8610 3.8845 3.8241 3.7023 3.8865 4.0222 3.6242 3.9518 3.8696 3.7005 3.9155 3.9610 3.8319 3.9607 3.5740 3.9411 3.7906 3.8399 3.8724 3.8614 1.0143 1.0114 1.0043 1.0081 1.0096 1.0118 1.0100 1.0080 1.0063 1.0093 1.0088 1.0020 0.9783 0.9864 1.0081 1.0146 1.0109 1.0009 0.9982 0.9904 0.9890 1.0017 1.0052 1.0070 1.0113 1.0087 0.9890 0.9914 0.9895
dispcorr: -0.035289171 hartree
energy: -1510.087526855910
dipole: -20.50082 19.51939 -0.98143 23.13809 -22.80200 0.33609 -1.85817 1.27444 -0.58372
magnitude: 1.19033 au
magnitude: 3.02559 debye
