program: Gaussian 09
title: 000067909
version: EM64L-G09RevD.01
frameworkgroup: C1[X(C3HCl3F4)]
method: RPBEPBE
basis: SDD
operation: Freq
keyword: #p
keyword: freq=noraman
keyword: PBEPBE/SDD
title: #p freq=noraman PBEPBE/SDD
converged: NO YES NO NO
title: Mulliken charges:
elementType: Cl Cl Cl F F F F C C C H
charge: 0.070151 0.092125 0.103278 -0.132276 -0.145229 -0.100418 -0.099201 0.480957 0.031486 -0.656667 0.355794
chargesum: 0.00000
title: Mulliken charges with hydrogens summed into heavy atoms:
elementType: Cl Cl Cl F F F F C C C
charge: 0.070151 0.092125 0.103278 -0.132276 -0.145229 -0.100418 -0.099201 0.480957 0.031486 -0.300873
polarizability: 6.37486302e+01 -6.21486844e+00 6.30526303e+01 2.96047875e+00 2.78136505e+00 5.57382905e+01
1716.lowfreq: -6.5849 0.0007 0.0015 0.0027 8.2229 15.5712 35.9024 68.9675 119.9447
frequency: 35.7352 68.9109 119.9309 165.9545 195.4890 217.1165 242.8571 288.4607 289.9442 305.2749 359.3333 380.6045 418.6019 525.5627 563.1806 680.5994 706.2316 746.9602 855.5881 962.7614 1004.9207 1044.7960 1129.0386 1146.1999 1191.6744 1266.7316 3146.5695
redmass: 23.3596 20.8260 23.4601 23.2318 20.7224 20.1299 20.0457 19.5501 20.1447 19.6931 17.8904 24.0461 15.7302 15.8225 16.9086 9.0776 8.5686 8.3255 10.4006 6.8102 10.0738 12.9558 9.6211 6.0923 1.1299 1.3539 1.0877
irintensity: 0.1378 0.1053 0.7097 2.1263 0.3223 1.3878 0.6186 0.7344 1.3784 1.8597 1.6547 0.5271 9.9424 16.8032 21.4835 46.6717 67.4234 65.4134 209.7020 52.8785 111.1557 210.5009 92.8923 3.9617 6.6524 3.7078 0.5559
temp: 298.150 k
press: 1.00000 atm
elementType: 17 17 17 9 9 9 9 6 6 6 1
symmnumber: 1
zpe: 108017.0 jmol-1
zpe.correction: 0.041141 hartree
zpe.thermalcorrener: 0.051760 hartree
zpe.thermalcorrenthalpy: 0.052704 hartree
zpe.thermalcorrgfe: 0.003109 hartree
zpe.sumelectzpe: -1893.654803 hartree
zpe.sumelectthermal: -1893.644185 hartree
zpe.sumelectthermalent: -1893.643241 hartree
zpe.sumelectthermalfe: -1893.692836 hartree
dipole: 0.1473 0.9802 -1.9218
dipole: 2.1624
quadrupole: -78.6272 -79.3507 -75.5042
quadrupole: -0.5010 0.2796 -0.4926
quadrupole: -0.7998 -1.5234 2.3232 -0.5010 0.2796 -0.4926
hfenergy: -1893.6959448 hartree
pointgroup: C01 [X(C3H1Cl3F4)]
dipole: -0.1229415 0.3196461 0.7787779 debye
dipolederiv: -0.2159005 -0.0329151 -0.133658 -0.0298005 -0.1273186 -0.1195124 -0.07172 -0.1044096 -0.6157072 -0.1196003 0.0369596 -0.0051588 -0.0882698 -0.5359773 0.1011633 0.0475858 0.1429396 -0.096124 -0.4295479 -0.2760286 0.0266099 -0.1768357 -0.2895153 0.0153191 -0.0096283 -0.0236074 -0.0593001 -0.3520451 -0.0095485 -0.1342167 -0.0203934 -0.2587165 -0.107792 -0.0486964 -0.0415818 -0.701953 -0.3492829 0.0783397 -0.0342693 0.0870033 -0.6698859 0.1812217 -0.0031105 0.0966738 -0.3162167 -0.5932759 0.2698639 0.1871908 0.1786641 -0.493904 -0.2118141 0.1255096 -0.1723766 -0.4073537 -0.3341935 -0.0813628 0.0339305 -0.0012861 -0.5598187 0.2947363 -0.0195809 0.2221991 -0.5143238 0.7364632 -0.108647 0.245095 -0.1708324 0.8169927 -0.0215608 -0.1039211 -0.0137012 0.9191209 1.0638295 -0.2267786 -0.1561263 -0.0414041 1.1733737 0.0125457 0.1000453 0.0948074 1.6166031 0.552244 0.3693007 0.0247168 0.2715494 0.9501274 -0.1711583 -0.0041891 -0.2117934 0.1410758 0.0413094 -0.0191832 -0.0541139 -0.0083948 -0.0053575 0.0268513 -0.0122944 0.0108501 0.0341788 unknown
polarizability: 62.9457341|6.0833722|63.6978593|4.0855912|-1.6108005|55.8959575 unknown
InChI: InChI=1S/C3HCl3F4/c4-1(5)2(7,8)3(6,9)10/h1H
charge 0 multiplicity 1
11 atoms
Cl 1.675822 0.532866 1.743707
Cl -1.525003 2.020859 -0.08746
Cl -2.913209 -0.656038 0.361247
F  -0.457839 -0.608436 -1.533246
F  -0.113276 -1.759008 0.415606
F  2.185843 -0.776592 -0.520515
F  1.392071 1.319714 -0.79388
C  -0.189027 -0.452822 -0.152702
C  1.258704 0.154145 -0.028263
C  -1.336904 0.29752 0.559823
H  -1.140383 0.367991 1.636084
