program: Orca
programVersion: 5.0.2
elementType: Si F O O C C C C C C C C C C C C C C C C C C C C C C C C C H H H H H H H H H H H H H H H H H H H H H H H H H H H H H
charge: 0
multiplicity: 1
keywords: wb97x-d3
keywords: def2-TZVPP
keywords: def2/J RIJCOSX
keywords: DEFGRID2
keywords: scfconv7
keywords: smallprint printgap noloewdin
keywords: NOSOSCF
formula: C25H29FO2Si
InChI: InChI=1/C25H29FO2Si/c1-4-27-21-13-15-23(16-14-21)29(2,3)18-8-9-20-12-17-24(26)25(19-20)28-22-10-6-5-7-11-22/h5-7,10-17,19H,4,8-9,18H2,1-3H3
58 atoms
Si -3.632918 1.295524 0.71747
F  1.8156 -3.770079 0.282548
O  2.223922 2.798402 0.323876
O  1.639437 -1.558412 -1.367194
C  -3.785334 -0.515295 0.191207
C  -3.59134 -0.727462 -1.312129
C  -1.819543 1.79428 0.572685
C  -4.192247 1.504337 2.502493
C  -4.656922 2.378347 -0.433617
C  -3.200961 -2.156279 -1.69158
C  -1.000919 1.942878 1.69892
C  -1.214575 1.996184 -0.668247
C  -1.864926 -2.576067 -1.138104
C  0.337307 2.277847 1.594231
C  0.131588 2.316694 -0.801409
C  0.91615 2.468417 0.338457
C  -0.7128 -1.849094 -1.439515
C  -1.745561 -3.690652 -0.316008
C  0.525681 -2.241267 -0.962607
C  -0.510144 -4.093636 0.174644
C  0.613333 -3.374562 -0.162342
C  2.866372 3.001412 -0.929498
C  4.292027 3.417106 -0.666886
C  2.516131 -1.056139 -0.437395
C  2.146063 -0.748945 0.864098
C  3.81384 -0.831051 -0.879834
C  3.09911 -0.231603 1.731769
C  4.751353 -0.307617 -0.002959
C  4.402002 -0.011646 1.308814
H  -3.038333 -1.08133 0.758827
H  -4.756353 -0.916915 0.497758
H  -2.831744 -0.050941 -1.713285
H  -4.514259 -0.466221 -1.835382
H  -4.05917 2.529226 2.853745
H  -5.251632 1.260299 2.604271
H  -3.645006 0.848134 3.182051
H  -4.299829 2.323422 -1.464136
H  -5.705537 2.073591 -0.43727
H  -4.620227 3.427035 -0.132463
H  -3.967561 -2.85369 -1.345819
H  -3.176802 -2.237733 -2.782165
H  -1.412541 1.799127 2.691518
H  -1.797219 1.911246 -1.578463
H  0.945763 2.393902 2.483098
H  0.541051 2.453733 -1.792969
H  -0.765262 -0.970002 -2.071758
H  -2.626933 -4.264186 -0.058995
H  -0.417985 -4.968355 0.805175
H  2.346969 3.778909 -1.498882
H  2.835867 2.080612 -1.521413
H  4.339513 4.356152 -0.114835
H  4.838253 2.656957 -0.10834
H  4.803346 3.563647 -1.617799
H  1.130061 -0.898263 1.207692
H  4.085012 -1.069501 -1.900655
H  2.811489 0.005901 2.747602
H  5.762856 -0.137577 -0.348271
H  5.138281 0.389825 1.992114
elementType: Si F O C H
totalener: -1510.05432809 hartree
nucrepener: 3005.68753308 hartree
electener: -4515.74186118 hartree
oneelecener: -8042.68298047 hartree
twoeener: 3526.94111929 hartree
cpcmener: -0.02849238 hartree
kineticenergy: 1503.90737227 hartree
xcener: -135.232929862818 hartree
chargesum: -0.0000000
charge: 0.490501 -0.219502 -0.335997 -0.338785 -0.247793 -0.131584 -0.161856 -0.464684 -0.427332 -0.095643 -0.067116 -0.167394 -0.012403 -0.338802 -0.279423 0.384994 -0.255491 -0.160535 0.188234 -0.172643 0.254263 0.020034 -0.276584 0.313359 -0.154624 -0.271942 -0.179228 -0.135162 -0.184676 0.079783 0.089967 0.071934 0.092704 0.106860 0.107040 0.102189 0.103783 0.107868 0.108350 0.081249 0.099639 0.143433 0.152772 0.134856 0.138836 0.139886 0.143731 0.150659 0.117312 0.104164 0.093993 0.085978 0.095542 0.149045 0.144181 0.159603 0.161461 0.160996
qa: 0.4905 -0.2195 -0.3360 -0.3388 -0.2478 -0.1316 -0.1619 -0.4647 -0.4273 -0.0956 -0.0671 -0.1674 -0.0124 -0.3388 -0.2794 0.3850 -0.2555 -0.1605 0.1882 -0.1726 0.2543 0.0200 -0.2766 0.3134 -0.1546 -0.2719 -0.1792 -0.1352 -0.1847 0.0798 0.0900 0.0719 0.0927 0.1069 0.1070 0.1022 0.1038 0.1079 0.1084 0.0812 0.0996 0.1434 0.1528 0.1349 0.1388 0.1399 0.1437 0.1507 0.1173 0.1042 0.0940 0.0860 0.0955 0.1490 0.1442 0.1596 0.1615 0.1610
va: 4.1277 1.0639 2.0347 2.0406 3.8141 3.8813 3.7372 3.9306 3.8845 3.8574 3.8080 3.8808 3.6970 4.0110 3.9027 3.6318 3.9518 3.8695 3.7091 3.9165 3.9513 3.7861 3.9626 3.5709 3.7975 3.9533 3.8658 3.8301 3.8475 1.0148 1.0109 1.0045 1.0083 1.0094 1.0121 1.0098 1.0081 1.0066 1.0090 1.0087 1.0017 0.9862 0.9772 1.0155 1.0135 1.0112 1.0013 0.9984 0.9923 0.9770 1.0040 1.0056 1.0057 1.0054 1.0101 0.9912 0.9870 0.9894
dispcorr: -0.035098166 hartree
energy: -1510.089426259535
dipole: -17.79958 16.90013 -0.89945 21.10739 -20.84807 0.25931 -0.65368 0.08716 -0.56653
magnitude: 1.09417 au
magnitude: 2.78116 debye
